BDBM83193 2-keto-3-pyridazin-3-yl-propionic acid ethyl ester::2-oxo-3-(3-pyridazinyl)propanoic acid ethyl ester::MLS002695075::SMR001560988::cid_260346::ethyl 2-oxidanylidene-3-pyridazin-3-yl-propanoate::ethyl 2-oxo-3-pyridazin-3-ylpropanoate
SMILES: CCOC(=O)C(=O)Cc1cccnn1
InChI Key: InChIKey=GEMVXGZBNSVVGD-UHFFFAOYSA-N
Data: 2 IC50
Activity Spreadsheet -- Enzyme Inhibition Constant Data from BindingDB
Found 2 hits for monomerid = 83193
Trg + Lig
Ki
nM
ΔG°
kcal/mole
IC50
nM
Kd
nM
EC50/IC50
nM
koff
s-1
kon
M-1s-1
pHTemp
°C
ELAV-like protein 1 [I180A]
(Homo sapiens (Human))
BDBM83193
(2-keto-3-pyridazin-3-yl-propionic acid ethyl ester...)
Show SMILES CCOC(=O)C(=O)Cc1cccnn1
Show InChI InChI=1S/C9H10N2O3/c1-2-14-9(13)8(12)6-7-4-3-5-10-11-7/h3-5H,2,6H2,1H3
PCBioAssay
n/an/a 4.60E+3n/an/an/an/an/an/a
11762
Curated by PubChem BioAssay
PubChem Bioassay (2015)
BindingDB Entry DOI: 10.7270/Q2HQ3XQ7
Carboxy-terminal domain RNA polymerase II polypeptide A small phosphatase 1
(Homo sapiens (Human))
BDBM83193
(2-keto-3-pyridazin-3-yl-propionic acid ethyl ester...)
Show SMILES CCOC(=O)C(=O)Cc1cccnn1
Show InChI InChI=1S/C9H10N2O3/c1-2-14-9(13)8(12)6-7-4-3-5-10-11-7/h3-5H,2,6H2,1H3
PCBioAssay
n/an/a 4.08E+3n/an/an/an/an/an/a
Burnham Center for Chemical Genomics
Curated by PubChem BioAssay
Assay Description
Data Source: Sanford-Burnham Center for Chemical Genomics (SBCCG) Source Affiliation: Sanford-Burnham Medical Research Institute (SBMRI, San Diego, C...
PubChem Bioassay (2011)
BindingDB Entry DOI: 10.7270/Q2V986KM