BDBM8336 N-[5-(pyridin-3-yl)-1H-pyrazolo[3,4-c]pyridazin-3-yl]cyclopropanecarboxamide::pyrazolopyridazine deriv. 16
SMILES: O=C(Nc1n[nH]c2nnc(cc12)-c1cccnc1)C1CC1
InChI Key: InChIKey=AGSPQSKJPUNTNL-UHFFFAOYSA-N
Data: 2 KI
Activity Spreadsheet -- Enzyme Inhibition Constant Data from BindingDB
Found 2 hits for monomerid = 8336
Trg + Lig
Ki
nM
ΔG°
kcal/mole
IC50
nM
Kd
nM
EC50/IC50
nM
koff
s-1
kon
M-1s-1
pHTemp
°C
Glycogen synthase kinase-3
(Homo sapiens (Human))
BDBM8336
(N-[5-(pyridin-3-yl)-1H-pyrazolo[3,4-c]pyridazin-3-...)
Show SMILES O=C(Nc1n[nH]c2nnc(cc12)-c1cccnc1)C1CC1
Show InChI InChI=1S/C14H12N6O/c21-14(8-3-4-8)16-12-10-6-11(9-2-1-5-15-7-9)17-19-13(10)20-18-12/h1-2,5-8H,3-4H2,(H2,16,18,19,20,21)
NCI pathway
Reactome pathway
0.0800 -13.6n/an/an/an/an/a7.022
GlaxoSmithKline
Assay Description
The biochemical activity of compounds was determined by incubation with specific enzyme and substrate in the presence 10 uM ATP/ [gamma-33P] ATP. Aft...
Bioorg Med Chem Lett 13: 1581-4 (2003)
Article DOI: 10.1016/s0960-894x(03)00135-5
BindingDB Entry DOI: 10.7270/Q2BK19JV
Cyclin-Dependent Kinase 2 (CDK2)
(Homo sapiens (Human))
BDBM8336
(N-[5-(pyridin-3-yl)-1H-pyrazolo[3,4-c]pyridazin-3-...)
Show SMILES O=C(Nc1n[nH]c2nnc(cc12)-c1cccnc1)C1CC1
Show InChI InChI=1S/C14H12N6O/c21-14(8-3-4-8)16-12-10-6-11(9-2-1-5-15-7-9)17-19-13(10)20-18-12/h1-2,5-8H,3-4H2,(H2,16,18,19,20,21)
NCI pathway
Reactome pathway
5 -11.2n/an/an/an/an/a7.521
GlaxoSmithKline
Assay Description
In vitro kinase assay using purified CDK2/Cyclin A was incubated at room temperature with substrate, and test compounds in the presence of 100 uM ATP...
Bioorg Med Chem Lett 13: 1581-4 (2003)
Article DOI: 10.1016/s0960-894x(03)00135-5
BindingDB Entry DOI: 10.7270/Q2BK19JV