BDBM83474 (6E)-6-[4-(2-furanylmethylamino)-1H-quinazolin-2-ylidene]-1-cyclohexa-2,4-dienone::(6E)-6-[4-(2-furfurylamino)-1H-quinazolin-2-ylidene]cyclohexa-2,4-dien-1-one::(6E)-6-[4-(furan-2-ylmethylamino)-1H-quinazolin-2-ylidene]cyclohexa-2,4-dien-1-one::MLS000081088::SMR000043294::cid_5389551
SMILES: Oc1ccccc1-c1nc(NCc2ccco2)c2ccccc2n1
InChI Key: InChIKey=JJFFMARTXFNMIY-UHFFFAOYSA-N
Data: 2 EC50
Activity Spreadsheet -- Enzyme Inhibition Constant Data from BindingDB
Found 2 hits for monomerid = 83474
Trg + Lig
Ki
nM
ΔG°
kcal/mole
IC50
nM
Kd
nM
EC50/IC50
nM
koff
s-1
kon
M-1s-1
pHTemp
°C
mRNA interferase toxin, antitoxin is MazE
(Escherichia coli str. K-12 substr. MG1655)
BDBM83474
((6E)-6-[4-(2-furanylmethylamino)-1H-quinazolin-2-y...)
Show SMILES Oc1ccccc1-c1nc(NCc2ccco2)c2ccccc2n1
Show InChI InChI=1S/C19H15N3O2/c23-17-10-4-2-8-15(17)19-21-16-9-3-1-7-14(16)18(22-19)20-12-13-6-5-11-24-13/h1-11,23H,12H2,(H,20,21,22)
PCBioAssay
n/an/an/an/a>9.90E+4n/an/an/an/a
Burnham Center for Chemical Genomics
Curated by PubChem BioAssay
Assay Description
Data Source: Sanford-Burnham Center for Chemical Genomics (SBCCG) Source Affiliation: Sanford-Burnham Medical Research Institute (SBMRI, San Diego, C...
PubChem Bioassay (2011)
BindingDB Entry DOI: 10.7270/Q2TB15DB
mRNA interferase toxin, antitoxin is MazE
(Escherichia coli str. K-12 substr. MG1655)
BDBM83474
((6E)-6-[4-(2-furanylmethylamino)-1H-quinazolin-2-y...)
Show SMILES Oc1ccccc1-c1nc(NCc2ccco2)c2ccccc2n1
Show InChI InChI=1S/C19H15N3O2/c23-17-10-4-2-8-15(17)19-21-16-9-3-1-7-14(16)18(22-19)20-12-13-6-5-11-24-13/h1-11,23H,12H2,(H,20,21,22)
PCBioAssay
n/an/an/an/a>9.90E+4n/an/an/an/a
Burnham Center for Chemical Genomics
Curated by PubChem BioAssay
Assay Description
Data Source: Sanford-Burnham Center for Chemical Genomics (SBCCG) Source Affiliation: Sanford-Burnham Medical Research Institute (SBMRI, San Diego, C...
PubChem Bioassay (2011)
BindingDB Entry DOI: 10.7270/Q2Z31X54