null
SMILES: CN(C)c1ccc(cc1)C1CC(=Nc2nnnn12)c1ccc(C)cc1
InChI Key: InChIKey=VQLLRNIZCJEQBA-UHFFFAOYSA-N
Activity Spreadsheet -- Enzyme Inhibition Constant Data from BindingDB
Found 2 hits for monomerid = 83486
Trg + Lig
Ki
nM
ΔG°
kcal/mole
IC50
nM
Kd
nM
EC50/IC50
nM
koff
s-1
kon
M-1s-1
pHTemp
°C
Endoribonuclease toxin MazF
(Escherichia coli str. K-12 substr. MG1655)
BDBM83486
(MLS000115322 | N,N-dimethyl-4-[5-(4-methylphenyl)-...)
Show SMILES CN(C)c1ccc(cc1)C1CC(=Nc2nnnn12)c1ccc(C)cc1 |c:12|
Show InChI InChI=1S/C19H20N6/c1-13-4-6-14(7-5-13)17-12-18(25-19(20-17)21-22-23-25)15-8-10-16(11-9-15)24(2)3/h4-11,18H,12H2,1-3H3
PCBioAssay
n/an/an/an/a>9.90E+4n/an/an/an/a
Burnham Center for Chemical Genomics
Curated by PubChem BioAssay
Assay Description
Data Source: Sanford-Burnham Center for Chemical Genomics (SBCCG) Source Affiliation: Sanford-Burnham Medical Research Institute (SBMRI, San Diego, C...
PubChem Bioassay (2011)
BindingDB Entry DOI: 10.7270/Q2TB15DB
Endoribonuclease toxin MazF
(Escherichia coli str. K-12 substr. MG1655)
BDBM83486
(MLS000115322 | N,N-dimethyl-4-[5-(4-methylphenyl)-...)
Show SMILES CN(C)c1ccc(cc1)C1CC(=Nc2nnnn12)c1ccc(C)cc1 |c:12|
Show InChI InChI=1S/C19H20N6/c1-13-4-6-14(7-5-13)17-12-18(25-19(20-17)21-22-23-25)15-8-10-16(11-9-15)24(2)3/h4-11,18H,12H2,1-3H3
PCBioAssay
n/an/an/an/a>9.90E+4n/an/an/an/a
Burnham Center for Chemical Genomics
Curated by PubChem BioAssay
Assay Description
Data Source: Sanford-Burnham Center for Chemical Genomics (SBCCG) Source Affiliation: Sanford-Burnham Medical Research Institute (SBMRI, San Diego, C...
PubChem Bioassay (2011)
BindingDB Entry DOI: 10.7270/Q2Z31X54