null
SMILES: N#C\C(=C/c1cn(nc1-c1cc2ccccc2o1)-c1ccccc1)c1nc2ccccc2[nH]1
InChI Key: InChIKey=DTCXFVNEUDHVEB-XMHGGMMESA-N
Activity Spreadsheet -- Enzyme Inhibition Constant Data from BindingDB
Found 2 hits for monomerid = 83577
Trg + Lig
Ki
nM
ΔG°
kcal/mole
IC50
nM
Kd
nM
EC50/IC50
nM
koff
s-1
kon
M-1s-1
pHTemp
°C
Endoribonuclease toxin MazF
(Escherichia coli str. K-12 substr. MG1655)
BDBM83577
((E)-2-(1H-benzimidazol-2-yl)-3-[3-(1-benzofuran-2-...)
Show SMILES N#C\C(=C/c1cn(nc1-c1cc2ccccc2o1)-c1ccccc1)c1nc2ccccc2[nH]1
Show InChI InChI=1S/C27H17N5O/c28-16-19(27-29-22-11-5-6-12-23(22)30-27)14-20-17-32(21-9-2-1-3-10-21)31-26(20)25-15-18-8-4-7-13-24(18)33-25/h1-15,17H,(H,29,30)/b19-14+
PCBioAssay
n/an/an/an/a 7.03E+3n/an/an/an/a
Burnham Center for Chemical Genomics
Curated by PubChem BioAssay
Assay Description
Data Source: Sanford-Burnham Center for Chemical Genomics (SBCCG) Source Affiliation: Sanford-Burnham Medical Research Institute (SBMRI, San Diego, C...
PubChem Bioassay (2011)
BindingDB Entry DOI: 10.7270/Q2TB15DB
Endoribonuclease toxin MazF
(Escherichia coli str. K-12 substr. MG1655)
BDBM83577
((E)-2-(1H-benzimidazol-2-yl)-3-[3-(1-benzofuran-2-...)
Show SMILES N#C\C(=C/c1cn(nc1-c1cc2ccccc2o1)-c1ccccc1)c1nc2ccccc2[nH]1
Show InChI InChI=1S/C27H17N5O/c28-16-19(27-29-22-11-5-6-12-23(22)30-27)14-20-17-32(21-9-2-1-3-10-21)31-26(20)25-15-18-8-4-7-13-24(18)33-25/h1-15,17H,(H,29,30)/b19-14+
PCBioAssay
n/an/an/an/a>9.90E+4n/an/an/an/a
Burnham Center for Chemical Genomics
Curated by PubChem BioAssay
Assay Description
Data Source: Sanford-Burnham Center for Chemical Genomics (SBCCG) Source Affiliation: Sanford-Burnham Medical Research Institute (SBMRI, San Diego, C...
PubChem Bioassay (2011)
BindingDB Entry DOI: 10.7270/Q2Z31X54