null
SMILES: NC(=O)c1nc(nc2n(-c3ccc(Cl)c(Cl)c3)c(=O)[nH]c12)-c1ccco1
InChI Key: InChIKey=XTKVGYICXHOKJK-UHFFFAOYSA-N
Activity Spreadsheet -- Enzyme Inhibition Constant Data from BindingDB
Found 1 hit for monomerid = 84144
Trg + Lig
Ki
nM
ΔG°
kcal/mole
IC50
nM
Kd
nM
EC50/IC50
nM
koff
s-1
kon
M-1s-1
pHTemp
°C
Multidrug efflux pump
(Candida albicans)
BDBM84144
(9-(3,4-dichlorophenyl)-2-(2-furanyl)-8-oxo-7H-puri...)
Show SMILES NC(=O)c1nc(nc2n(-c3ccc(Cl)c(Cl)c3)c(=O)[nH]c12)-c1ccco1
Show InChI InChI=1S/C16H9Cl2N5O3/c17-8-4-3-7(6-9(8)18)23-15-12(21-16(23)25)11(13(19)24)20-14(22-15)10-2-1-5-26-10/h1-6H,(H2,19,24)(H,21,25)
PCBioAssay
n/an/an/an/a 1.40E+4n/an/an/an/a
NMMLSC
Curated by PubChem BioAssay
Assay Description
UNMCMD Assay Overview: Assay Support: 1 R03 MH087406-01A1 Project Title: Identification of broad-spectrum antifungal efflux pump inhibitors ...
PubChem Bioassay (2011)
BindingDB Entry DOI: 10.7270/Q20V8B9F