BDBM8498 (2R)-2-cyclopropyl-2-[(4-fluoro-3-methylbenzene)sulfonamido]-N-hydroxyacetamide::hydroxamate analogue 35
SMILES: Cc1cc(ccc1F)S(=O)(=O)N[C@H](C1CC1)C(=O)NO
InChI Key: InChIKey=ATUWCAJLRJDQBC-LLVKDONJSA-N
Data: 1 IC50
Activity Spreadsheet -- Enzyme Inhibition Constant Data from BindingDB
Found 1 hit for monomerid = 8498
Trg + Lig
Ki
nM
ΔG°
kcal/mole
IC50
nM
Kd
nM
EC50/IC50
nM
koff
s-1
kon
M-1s-1
pHTemp
°C
Anthrax Lethal Factor (LF)
(Bacillus anthracis)
BDBM8498
((2R)-2-cyclopropyl-2-[(4-fluoro-3-methylbenzene)su...)
Show SMILES Cc1cc(ccc1F)S(=O)(=O)N[C@H](C1CC1)C(=O)NO |r|
Show InChI InChI=1S/C12H15FN2O4S/c1-7-6-9(4-5-10(7)13)20(18,19)15-11(8-2-3-8)12(16)14-17/h4-6,8,11,15,17H,2-3H2,1H3,(H,14,16)/t11-/m1/s1
NCI pathway
Reactome pathway
n/an/a 120n/an/an/an/an/an/a
Merck Research Laboratories
Assay Description
The assay was performed in a 96-well plate, each well contained substrate peptide, LF, and the test compound. The C-terminally fluorophore of substra...
Bioorg Med Chem Lett 16: 964-8 (2006)
Article DOI: 10.1016/j.bmcl.2005.10.088
BindingDB Entry DOI: 10.7270/Q2K35RV4