BDBM8500 (2R)-2-cyclopentyl-2-[(4-fluoro-3-methylbenzene)sulfonamido]-N-hydroxyacetamide::hydroxamate analogue 37
SMILES: Cc1cc(ccc1F)S(=O)(=O)N[C@H](C1CCCC1)C(=O)NO
InChI Key: InChIKey=CUHXSENFQJVQEB-CYBMUJFWSA-N
Data: 1 IC50
Activity Spreadsheet -- Enzyme Inhibition Constant Data from BindingDB
Found 1 hit for monomerid = 8500
Trg + Lig
Ki
nM
ΔG°
kcal/mole
IC50
nM
Kd
nM
EC50/IC50
nM
koff
s-1
kon
M-1s-1
pHTemp
°C
Anthrax Lethal Factor (LF)
(Bacillus anthracis)
BDBM8500
((2R)-2-cyclopentyl-2-[(4-fluoro-3-methylbenzene)su...)
Show SMILES Cc1cc(ccc1F)S(=O)(=O)N[C@H](C1CCCC1)C(=O)NO |r|
Show InChI InChI=1S/C14H19FN2O4S/c1-9-8-11(6-7-12(9)15)22(20,21)17-13(14(18)16-19)10-4-2-3-5-10/h6-8,10,13,17,19H,2-5H2,1H3,(H,16,18)/t13-/m1/s1
NCI pathway
Reactome pathway
n/an/a 64n/an/an/an/an/an/a
Merck Research Laboratories
Assay Description
The assay was performed in a 96-well plate, each well contained substrate peptide, LF, and the test compound. The C-terminally fluorophore of substra...
Bioorg Med Chem Lett 16: 964-8 (2006)
Article DOI: 10.1016/j.bmcl.2005.10.088
BindingDB Entry DOI: 10.7270/Q2K35RV4