BDBM8511 (2R)-2-[(4-fluoro-3-methylbenzene)sulfonamido]-4-(1-formamido-1-methylethan-1-aminium)-N-hydroxybutanamide::hydroxamate analogue 48
SMILES: Cc1cc(ccc1F)S(=O)(=O)N[C@H](CCNC(=O)C(C)(C)[NH3+])C(=O)NO
InChI Key: InChIKey=JLNPSAGPCBTFCX-GFCCVEGCSA-O
Data: 1 IC50
Activity Spreadsheet -- Enzyme Inhibition Constant Data from BindingDB
Found 1 hit for monomerid = 8511
Trg + Lig
Ki
nM
ΔG°
kcal/mole
IC50
nM
Kd
nM
EC50/IC50
nM
koff
s-1
kon
M-1s-1
pHTemp
°C
Anthrax Lethal Factor (LF)
(Bacillus anthracis)
BDBM8511
((2R)-2-[(4-fluoro-3-methylbenzene)sulfonamido]-4-(...)
Show SMILES Cc1cc(ccc1F)S(=O)(=O)N[C@H](CCNC(=O)C(C)(C)[NH3+])C(=O)NO |r|
Show InChI InChI=1S/C15H23FN4O5S/c1-9-8-10(4-5-11(9)16)26(24,25)20-12(13(21)19-23)6-7-18-14(22)15(2,3)17/h4-5,8,12,20,23H,6-7,17H2,1-3H3,(H,18,22)(H,19,21)/p+1/t12-/m1/s1
NCI pathway
Reactome pathway
n/an/a 57n/an/an/an/an/an/a
Merck Research Laboratories
Assay Description
The assay was performed in a 96-well plate, each well contained substrate peptide, LF, and the test compound. The C-terminally fluorophore of substra...
Bioorg Med Chem Lett 16: 964-8 (2006)
Article DOI: 10.1016/j.bmcl.2005.10.088
BindingDB Entry DOI: 10.7270/Q2K35RV4