BDBM85322 GlcN-6-P synthase inhibitor, 15 (racemic mixture)
SMILES: CCN(CC)S(=O)(=O)CCC(N)C(=O)OC
InChI Key: InChIKey=VTKLETMLIBWDSP-UHFFFAOYSA-N
Data: 1 KI  1 IC50
Activity Spreadsheet -- Enzyme Inhibition Constant Data from BindingDB
Found 1 hit for monomerid = 85322
Trg + Lig
Ki
nM
ΔG°
kcal/mole
IC50
nM
Kd
nM
EC50/IC50
nM
koff
s-1
kon
M-1s-1
pHTemp
°C
Glucosamine-6- Phosphate Synthase
(Candida albicans)
BDBM85322
(GlcN-6-P synthase inhibitor, 15 (racemic mixture))
Show SMILES CCN(CC)S(=O)(=O)CCC(N)C(=O)OC
Show InChI InChI=1S/C9H20N2O4S/c1-4-11(5-2)16(13,14)7-6-8(10)9(12)15-3/h8H,4-7,10H2,1-3H3
6.00E+5n/a 1.60E+6n/an/an/an/a6.85n/a
Technical University of Gdansk
Assay Description
Two assays of GlcN-6-P synthase activity were used 1)determination of GlcN-6_P formation by the modified Elson-Morgan procedure and 2) continuous qua...
Bioorg Chem 25: 283-296 (1997)
BindingDB Entry DOI: 10.7270/Q2RB7351