BDBM85471 L-2-bromosuccinic acid, 4
SMILES: OC(=O)CC(Br)C(O)=O
InChI Key: InChIKey=QQWGVQWAEANRTK-UHFFFAOYSA-N
Data: 1 KI
Activity Spreadsheet -- Enzyme Inhibition Constant Data from BindingDB
Found 1 hit for monomerid = 85471
Trg + Lig
Ki
nM
ΔG°
kcal/mole
IC50
nM
Kd
nM
EC50/IC50
nM
koff
s-1
kon
M-1s-1
pHTemp
°C
N(4)-(beta-N-acetylglucosaminyl)-L-asparaginase
(Homo sapiens (Human))
BDBM85471
(L-2-bromosuccinic acid, 4)
Show SMILES OC(=O)CC(Br)C(O)=O
Show InChI InChI=1S/C4H5BrO4/c5-2(4(8)9)1-3(6)7/h2H,1H2,(H,6,7)(H,8,9)
2.70E+6 -3.64n/an/an/an/an/a5.837
University of North Carolina
Assay Description
Glycosylasparaginase activity was measured in citrate-phosphate buffer at pH 5.8 at 37 C. N-Acetyl-D-glucosamine released during the reaction was me...
J Enzym Inhib 16: 269-74 (2001)
Article DOI: 10.1080/14756360109162375
BindingDB Entry DOI: 10.7270/Q2P55M2S