BDBM85472 D,L-2-Methylsuccinic acid, 5
SMILES: CC(CC(O)=O)C(O)=O
InChI Key: InChIKey=WXUAQHNMJWJLTG-UHFFFAOYSA-N
Data: 1 KI
PDB links: 1 PDB ID matches this monomer.
Activity Spreadsheet -- Enzyme Inhibition Constant Data from BindingDB
Found 1 hit for monomerid = 85472
Trg + Lig
Ki
nM
ΔG°
kcal/mole
IC50
nM
Kd
nM
EC50/IC50
nM
koff
s-1
kon
M-1s-1
pHTemp
°C
Glycosylasparaginase (GA)
(Homo sapiens (Human))
BDBM85472
(D,L-2-Methylsuccinic acid, 5)
Show SMILES CC(CC(O)=O)C(O)=O
Show InChI InChI=1S/C5H8O4/c1-3(5(8)9)2-4(6)7/h3H,2H2,1H3,(H,6,7)(H,8,9)
7.00E+5 -4.47n/an/an/an/an/a5.837
University of North Carolina
Assay Description
Glycosylasparaginase activity was measured in citrate-phosphate buffer at pH 5.8 at 37 C. N-Acetyl-D-glucosamine released during the reaction was me...
J Enzym Inhib 16: 269-74 (2001)
Article DOI: 10.1080/14756360109162375
BindingDB Entry DOI: 10.7270/Q2P55M2S