BDBM85517 CAS_171436-38-7::SL-NH2::SLIGRL-NH2
SMILES: [#6]-[#6]-[#6@H](-[#6])-[#6@H](-[#7]-[#6](=O)-[#6@H](-[#6]-[#6](-[#6])-[#6])-[#7]-[#6](=O)-[#6@@H](-[#7])-[#6]-[#8])-[#6](=O)-[#7]-[#6]-[#6](=O)-[#7]-[#6@@H](-[#6]-[#6]-[#6]\[#7]=[#6](\[#7])-[#7])-[#6](=O)-[#7]-[#6@@H](-[#6]-[#6](-[#6])-[#6])-[#6](-[#7])=O
InChI Key: InChIKey=SGPMJRPYYIJZPC-JYAZKYGWSA-N
Data: 1 KI  3 EC50
Activity Spreadsheet -- Enzyme Inhibition Constant Data from BindingDB
Found 4 hits for monomerid = 85517
Trg + Lig
Ki
nM
ΔG°
kcal/mole
IC50
nM
Kd
nM
EC50/IC50
nM
koff
s-1
kon
M-1s-1
pHTemp
°C
F2RL1
(RAT)
BDBM85517
(CAS_171436-38-7 | SL-NH2 | SLIGRL-NH2)
Show SMILES [#6]-[#6]-[#6@H](-[#6])-[#6@H](-[#7]-[#6](=O)-[#6@H](-[#6]-[#6](-[#6])-[#6])-[#7]-[#6](=O)-[#6@@H](-[#7])-[#6]-[#8])-[#6](=O)-[#7]-[#6]-[#6](=O)-[#7]-[#6@@H](-[#6]-[#6]-[#6]\[#7]=[#6](\[#7])-[#7])-[#6](=O)-[#7]-[#6@@H](-[#6]-[#6](-[#6])-[#6])-[#6](-[#7])=O |r|
Show InChI InChI=1S/C29H56N10O7/c1-7-17(6)23(39-27(45)21(12-16(4)5)38-25(43)18(30)14-40)28(46)35-13-22(41)36-19(9-8-10-34-29(32)33)26(44)37-20(24(31)42)11-15(2)3/h15-21,23,40H,7-14,30H2,1-6H3,(H2,31,42)(H,35,46)(H,36,41)(H,37,44)(H,38,43)(H,39,45)(H4,32,33,34)/t17-,18-,19-,20-,21-,23-/m0/s1
Reactome pathway
260n/an/an/an/an/an/an/an/a
The University of Calgary
Curated by PDSP Ki Database
J Pharmacol Exp Ther 290: 753-60 (1999)
BindingDB Entry DOI: 10.7270/Q2N878BQ
Proteinase-activated receptor 2
(Homo sapiens (Human))
BDBM85517
(CAS_171436-38-7 | SL-NH2 | SLIGRL-NH2)
Show SMILES [#6]-[#6]-[#6@H](-[#6])-[#6@H](-[#7]-[#6](=O)-[#6@H](-[#6]-[#6](-[#6])-[#6])-[#7]-[#6](=O)-[#6@@H](-[#7])-[#6]-[#8])-[#6](=O)-[#7]-[#6]-[#6](=O)-[#7]-[#6@@H](-[#6]-[#6]-[#6]\[#7]=[#6](\[#7])-[#7])-[#6](=O)-[#7]-[#6@@H](-[#6]-[#6](-[#6])-[#6])-[#6](-[#7])=O |r|
Show InChI InChI=1S/C29H56N10O7/c1-7-17(6)23(39-27(45)21(12-16(4)5)38-25(43)18(30)14-40)28(46)35-13-22(41)36-19(9-8-10-34-29(32)33)26(44)37-20(24(31)42)11-15(2)3/h15-21,23,40H,7-14,30H2,1-6H3,(H2,31,42)(H,35,46)(H,36,41)(H,37,44)(H,38,43)(H,39,45)(H4,32,33,34)/t17-,18-,19-,20-,21-,23-/m0/s1
Reactome pathway
n/an/an/an/a 5.00E+3n/an/an/an/a
The University of Queensland
Curated by ChEMBL
Assay Description
Agonist activity at PAR2 (unknown origin) by cell-based assay
J Med Chem 56: 7477-97 (2013)
Article DOI: 10.1021/jm400638v
BindingDB Entry DOI: 10.7270/Q2NC62MG
Proteinase-activated receptor 2
(Homo sapiens (Human))
BDBM85517
(CAS_171436-38-7 | SL-NH2 | SLIGRL-NH2)
Show SMILES [#6]-[#6]-[#6@H](-[#6])-[#6@H](-[#7]-[#6](=O)-[#6@H](-[#6]-[#6](-[#6])-[#6])-[#7]-[#6](=O)-[#6@@H](-[#7])-[#6]-[#8])-[#6](=O)-[#7]-[#6]-[#6](=O)-[#7]-[#6@@H](-[#6]-[#6]-[#6]\[#7]=[#6](\[#7])-[#7])-[#6](=O)-[#7]-[#6@@H](-[#6]-[#6](-[#6])-[#6])-[#6](-[#7])=O |r|
Show InChI InChI=1S/C29H56N10O7/c1-7-17(6)23(39-27(45)21(12-16(4)5)38-25(43)18(30)14-40)28(46)35-13-22(41)36-19(9-8-10-34-29(32)33)26(44)37-20(24(31)42)11-15(2)3/h15-21,23,40H,7-14,30H2,1-6H3,(H2,31,42)(H,35,46)(H,36,41)(H,37,44)(H,38,43)(H,39,45)(H4,32,33,34)/t17-,18-,19-,20-,21-,23-/m0/s1
Reactome pathway
n/an/an/an/a 1.00E+4n/an/an/an/a
ACADIA Pharmaceuticals AB
Curated by ChEMBL
Assay Description
Agonist activity at human PAR2 expressed in HEK293T cells assessed as effect on intracellular calcium mobilization by R-SAT assay
J Med Chem 51: 5490-3 (2008)
Article DOI: 10.1021/jm800754r
BindingDB Entry DOI: 10.7270/Q290251P
Proteinase-activated receptor 2
(Homo sapiens (Human))
BDBM85517
(CAS_171436-38-7 | SL-NH2 | SLIGRL-NH2)
Show SMILES [#6]-[#6]-[#6@H](-[#6])-[#6@H](-[#7]-[#6](=O)-[#6@H](-[#6]-[#6](-[#6])-[#6])-[#7]-[#6](=O)-[#6@@H](-[#7])-[#6]-[#8])-[#6](=O)-[#7]-[#6]-[#6](=O)-[#7]-[#6@@H](-[#6]-[#6]-[#6]\[#7]=[#6](\[#7])-[#7])-[#6](=O)-[#7]-[#6@@H](-[#6]-[#6](-[#6])-[#6])-[#6](-[#7])=O |r|
Show InChI InChI=1S/C29H56N10O7/c1-7-17(6)23(39-27(45)21(12-16(4)5)38-25(43)18(30)14-40)28(46)35-13-22(41)36-19(9-8-10-34-29(32)33)26(44)37-20(24(31)42)11-15(2)3/h15-21,23,40H,7-14,30H2,1-6H3,(H2,31,42)(H,35,46)(H,36,41)(H,37,44)(H,38,43)(H,39,45)(H4,32,33,34)/t17-,18-,19-,20-,21-,23-/m0/s1
Reactome pathway
n/an/an/an/a 4.20E+3n/an/an/an/a
The University of Queensland
Curated by ChEMBL
Assay Description
Agonist activity at PAR2 in human HT-29 cells assessed as increase in intracellular calcium release
J Med Chem 56: 7477-97 (2013)
Article DOI: 10.1021/jm400638v
BindingDB Entry DOI: 10.7270/Q2NC62MG