BDBM856 1OH-2(Cbz-Tle)3PhPr [14]paracyclophane deriv. 22::benzyl N-[(1S)-1-{[(1S,2S)-1-[(9R,12R)-8,11-dioxo-9-(propan-2-yl)-2-oxa-7,10,13-triazabicyclo[13.2.2]nonadeca-1(17),15,18-trien-12-yl]-1-hydroxy-3-phenylpropan-2-yl]carbamoyl}-2-methylpropyl]carbamate
SMILES: CC(C)[C@H](NC(=O)OCc1ccccc1)C(=O)N[C@@H](Cc1ccccc1)C(O)[C@H]1NCc2ccc(OCCCCNC(=O)C(NC1=O)C(C)C)cc2
InChI Key: InChIKey=SFYLJGNBGITWFY-OTXQKLNXSA-N
Data: 1 KI
Activity Spreadsheet -- Enzyme Inhibition Constant Data from BindingDB
Found 1 hit for monomerid = 856
Trg + Lig
Ki
nM
ΔG°
kcal/mole
IC50
nM
Kd
nM
EC50/IC50
nM
koff
s-1
kon
M-1s-1
pHTemp
°C
HIV-1 Protease
(Human immunodeficiency virus type 1)
BDBM856
(1OH-2(Cbz-Tle)3PhPr [14]paracyclophane deriv. 22 |...)
Show SMILES CC(C)[C@H](NC(=O)OCc1ccccc1)C(=O)N[C@@H](Cc1ccccc1)C(O)[C@H]1NCc2ccc(OCCCCNC(=O)C(NC1=O)C(C)C)cc2 |r|
Show InChI InChI=1S/C40H53N5O7/c1-26(2)33-37(47)41-21-11-12-22-51-31-19-17-29(18-20-31)24-42-35(39(49)44-33)36(46)32(23-28-13-7-5-8-14-28)43-38(48)34(27(3)4)45-40(50)52-25-30-15-9-6-10-16-30/h5-10,13-20,26-27,32-36,42,46H,11-12,21-25H2,1-4H3,(H,41,47)(H,43,48)(H,44,49)(H,45,50)/t32-,33?,34-,35+,36?/m0/s1
6.60 -11.6n/an/an/an/an/a6.2537
Sandoz Research Institute
Assay Description
Enzymatic activity was measured by following cleavage of the substrate H-Lys-Ala-Arg-Val-Leu-pNph-Glu-Ala-Nle-NH2. Products of the cleavage reaction ...
J Med Chem 39: 3291-9 (1996)
Article DOI: 10.1021/jm950641i
BindingDB Entry DOI: 10.7270/Q2P84935