null
SMILES: C(CCN1CCC(CC1)N1CCCCC1)COc1ccccc1
InChI Key: InChIKey=YQUWKJDGVVUQJS-UHFFFAOYSA-N
Activity Spreadsheet -- Enzyme Inhibition Constant Data from BindingDB
Found 1 hit for monomerid = 85774
Trg + Lig
Ki
nM
ΔG°
kcal/mole
IC50
nM
Kd
nM
EC50/IC50
nM
koff
s-1
kon
M-1s-1
pHTemp
°C
Tyrosinase
(Homo sapiens (Human))
BDBM85774
(Tyrosinase Inhibitor, 10)
Show SMILES C(CCN1CCC(CC1)N1CCCCC1)COc1ccccc1
Show InChI InChI=1S/C20H32N2O/c1-3-9-20(10-4-1)23-18-8-7-13-21-16-11-19(12-17-21)22-14-5-2-6-15-22/h1,3-4,9-10,19H,2,5-8,11-18H2
n/an/a 1.95E+4n/an/an/an/a6.837
University of Karachi
Assay Description
Tyrosinase inhibition assays were performed in a 96-well microplate format using SpectraMax 340 (Molecular Devices, CA, USA) microplate reader accord...
J Enzyme Inhib Med Chem 20: 401-7 (2005)
Article DOI: 10.1080/14756360500179333
BindingDB Entry DOI: 10.7270/Q29G5KBN