null
SMILES: CC(C)CCOC(=S)S[Na]
InChI Key: InChIKey=VLOVRZZIJXGVFV-UHFFFAOYSA-M
Activity Spreadsheet -- Enzyme Inhibition Constant Data from BindingDB
Found 2 hits for monomerid = 86064
Trg + Lig
Ki
nM
ΔG°
kcal/mole
IC50
nM
Kd
nM
EC50/IC50
nM
koff
s-1
kon
M-1s-1
pHTemp
°C
Polyphenol oxidase 2
(Agaricus bisporus (Common mushroom))
BDBM86064
(Iso-pentyl xanthate, III)
Show SMILES CC(C)CCOC(=S)S[Na]
Show InChI InChI=1S/C6H12OS2.Na/c1-5(2)3-4-7-6(8)9;/h5H,3-4H2,1-2H3,(H,8,9);/q;+1/p-1
6.10E+3 -6.99n/an/an/an/an/a6.820
University of Tehran
Assay Description
Kinetic assay of catecholase and cresolase activities was carried out through depletion of MeBACat and MePAPh for 1 or 2 min with enzyme concentratio...
J Enzyme Inhib Med Chem 22: 239-46 (2007)
Article DOI: 10.1080/14756360601114536
BindingDB Entry DOI: 10.7270/Q2XS5SZW
Polyphenol oxidase 2
(Agaricus bisporus (Common mushroom))
BDBM86064
(Iso-pentyl xanthate, III)
Show SMILES CC(C)CCOC(=S)S[Na]
Show InChI InChI=1S/C6H12OS2.Na/c1-5(2)3-4-7-6(8)9;/h5H,3-4H2,1-2H3,(H,8,9);/q;+1/p-1
4.22E+4 -5.86n/an/an/an/an/a6.820
University of Tehran
Assay Description
Kinetic assay of catecholase and cresolase activities was carried out through depletion of MeBACat and MePAPh for 1 or 2 min with enzyme concentratio...
J Enzyme Inhib Med Chem 22: 239-46 (2007)
Article DOI: 10.1080/14756360601114536
BindingDB Entry DOI: 10.7270/Q2XS5SZW