BDBM86095 2-Cyanopyrrolidine Derivative, 24
SMILES: CC(C)CC(NC(=O)C(=C\c1ccccc1)\c1ccccc1)C(=O)N1CCC[C@H]1C#N
InChI Key: InChIKey=QJBXJTZHTYRHGA-ZUGJCSJQSA-N
Data: 2 KI
Activity Spreadsheet -- Enzyme Inhibition Constant Data from BindingDB
Found 2 hits for monomerid = 86095
Trg + Lig
Ki
nM
ΔG°
kcal/mole
IC50
nM
Kd
nM
EC50/IC50
nM
koff
s-1
kon
M-1s-1
pHTemp
°C
Cathepsin B
(Homo sapiens (Human))
BDBM86095
(2-Cyanopyrrolidine Derivative, 24)
Show SMILES CC(C)CC(NC(=O)C(=C\c1ccccc1)\c1ccccc1)C(=O)N1CCC[C@H]1C#N |r|
Show InChI InChI=1S/C26H29N3O2/c1-19(2)16-24(26(31)29-15-9-14-22(29)18-27)28-25(30)23(21-12-7-4-8-13-21)17-20-10-5-3-6-11-20/h3-8,10-13,17,19,22,24H,9,14-16H2,1-2H3,(H,28,30)/b23-17+/t22-,24?/m0/s1
Reactome pathway
5.30E+3 -7.14n/an/an/an/an/a6.023
The M S University of Baroda
Assay Description
The fluorescence for the assay was monitored on a Varian Gemini spectrofluorometer with the excitation and emission wavelengths at 380 and 440nm. Th...
J Enzyme Inhib Med Chem 23: 190-7 (2008)
Article DOI: 10.1080/14756360701504842
BindingDB Entry DOI: 10.7270/Q2DV1HFC
Cathepsin B
(Homo sapiens (Human))
BDBM86095
(2-Cyanopyrrolidine Derivative, 24)
Show SMILES CC(C)CC(NC(=O)C(=C\c1ccccc1)\c1ccccc1)C(=O)N1CCC[C@H]1C#N |r|
Show InChI InChI=1S/C26H29N3O2/c1-19(2)16-24(26(31)29-15-9-14-22(29)18-27)28-25(30)23(21-12-7-4-8-13-21)17-20-10-5-3-6-11-20/h3-8,10-13,17,19,22,24H,9,14-16H2,1-2H3,(H,28,30)/b23-17+/t22-,24?/m0/s1
Reactome pathway
>1.00E+5>-5.42n/an/an/an/an/a6.023
The M S University of Baroda
Assay Description
The fluorescence for the assay was monitored on a Varian Gemini spectrofluorometer with the excitation and emission wavelengths at 380 and 440nm. Th...
J Enzyme Inhib Med Chem 23: 190-7 (2008)
Article DOI: 10.1080/14756360701504842
BindingDB Entry DOI: 10.7270/Q2DV1HFC