BDBM862 1OH-2(Cbz-Tle)3PhPr [14]paracyclophane deriv. 26::tert-butyl N-[(1S,2S)-1-[(13R,16R)-12,15-dioxo-13-(propan-2-yl)-2,5,8-trioxa-11,14,17-triazabicyclo[17.2.2]tricosa-1(21),19,22-trien-16-yl]-1-hydroxy-3-phenylpropan-2-yl]carbamate
SMILES: CC(C)C1NC(=O)[C@H](NCc2ccc(OCCOCCOCCNC1=O)cc2)C(O)[C@H](Cc1ccccc1)NC(=O)OC(C)(C)C
InChI Key: InChIKey=VWFACMZZIZWUON-ZQTFWZTISA-N
Data: 1 KI
Activity Spreadsheet -- Enzyme Inhibition Constant Data from BindingDB
Found 1 hit for monomerid = 862
Trg + Lig
Ki
nM
ΔG°
kcal/mole
IC50
nM
Kd
nM
EC50/IC50
nM
koff
s-1
kon
M-1s-1
pHTemp
°C
HIV-1 Protease
(Human immunodeficiency virus type 1)
BDBM862
(1OH-2(Cbz-Tle)3PhPr [14]paracyclophane deriv. 26 |...)
Show SMILES CC(C)C1NC(=O)[C@H](NCc2ccc(OCCOCCOCCNC1=O)cc2)C(O)[C@H](Cc1ccccc1)NC(=O)OC(C)(C)C |r|
Show InChI InChI=1S/C34H50N4O8/c1-23(2)28-31(40)35-15-16-43-17-18-44-19-20-45-26-13-11-25(12-14-26)22-36-29(32(41)38-28)30(39)27(21-24-9-7-6-8-10-24)37-33(42)46-34(3,4)5/h6-14,23,27-30,36,39H,15-22H2,1-5H3,(H,35,40)(H,37,42)(H,38,41)/t27-,28?,29+,30?/m0/s1
12.6 -11.2n/an/an/an/an/a6.2537
Sandoz Research Institute
Assay Description
Enzymatic activity was measured by following cleavage of the substrate H-Lys-Ala-Arg-Val-Leu-pNph-Glu-Ala-Nle-NH2. Products of the cleavage reaction ...
J Med Chem 39: 3291-9 (1996)
Article DOI: 10.1021/jm950641i
BindingDB Entry DOI: 10.7270/Q2P84935