BDBM86593 ZINC 10436232, 69
SMILES: CC(C)[NH2+]Cc1ccc(o1)-c1ccccc1
InChI Key: InChIKey=WPPQAAJWSRLDOO-UHFFFAOYSA-O
Data: 2 KI
Activity Spreadsheet -- Enzyme Inhibition Constant Data from BindingDB
Found 2 hits for monomerid = 86593
Trg + Lig
Ki
nM
ΔG°
kcal/mole
IC50
nM
Kd
nM
EC50/IC50
nM
koff
s-1
kon
M-1s-1
pHTemp
°C
Histamine H1 receptor
(Homo sapiens (Human))
BDBM86593
(ZINC 10436232, 69)
Show SMILES CC(C)[NH2+]Cc1ccc(o1)-c1ccccc1
Show InChI InChI=1S/C14H17NO/c1-11(2)15-10-13-8-9-14(16-13)12-6-4-3-5-7-12/h3-9,11,15H,10H2,1-2H3/p+1
Reactome pathway
4.57E+3n/an/an/an/an/an/an/an/a
VU University Amsterdam
Curated by ChEMBL
Assay Description
Displacement of [3H]mepyramine from human histamine H1 receptor expressed in HEK293 cells after 1 to 1.5 hrs by scintillation counting
J Med Chem 54: 8195-206 (2011)
Article DOI: 10.1021/jm2011589
BindingDB Entry DOI: 10.7270/Q2QF8T85
D(3) dopamine receptor
(Homo sapiens (Human))
BDBM86593
(ZINC 10436232, 69)
Show SMILES CC(C)[NH2+]Cc1ccc(o1)-c1ccccc1
Show InChI InChI=1S/C14H17NO/c1-11(2)15-10-13-8-9-14(16-13)12-6-4-3-5-7-12/h3-9,11,15H,10H2,1-2H3/p+1
8.89E+3 -6.82n/an/an/an/an/a7.422
University of California San Francisco
Assay Description
Affinities for D3-dopaminergic, D2-dopaminergic and beta2-adrenergic receptors were determined by radioligand competition binding at the National Ins...
Nat Chem Biol 7: 769-78 (2011)
Article DOI: 10.1038/nchembio.662
BindingDB Entry DOI: 10.7270/Q2TM78P6