BDBM86608 Benzo[e]pyrimido[5,4-b][1,4]diazepin-6(11H)-one, 14
SMILES: CN1c2ccccc2C(=O)N(C)c2cnc(Nc3ccc(OCc4ccccn4)c(Cl)c3)nc12
InChI Key: InChIKey=DHGCUTOPNQKCLE-UHFFFAOYSA-N
Data: 2 IC50
Activity Spreadsheet -- Enzyme Inhibition Constant Data from BindingDB
Found 2 hits for monomerid = 86608
Trg + Lig
Ki
nM
ΔG°
kcal/mole
IC50
nM
Kd
nM
EC50/IC50
nM
koff
s-1
kon
M-1s-1
pHTemp
°C
Aurora kinase B
(Homo sapiens (Human))
BDBM86608
(Benzo[e]pyrimido[5,4-b][1,4]diazepin-6(11H)-one, 1...)
Show SMILES CN1c2ccccc2C(=O)N(C)c2cnc(Nc3ccc(OCc4ccccn4)c(Cl)c3)nc12
Show InChI InChI=1S/C25H21ClN6O2/c1-31-20-9-4-3-8-18(20)24(33)32(2)21-14-28-25(30-23(21)31)29-16-10-11-22(19(26)13-16)34-15-17-7-5-6-12-27-17/h3-14H,15H2,1-2H3,(H,28,29,30)
Reactome pathway
n/an/a 417n/an/an/an/an/an/a
Harvard Medical School
Assay Description
In vitro kinase assay of Aurora A, B, and C using Z-LYTE technology (Invitrogen) and ATP at Km apparent for each kinase.
ACS Chem Biol 7: 185-96 (2012)
Article DOI: 10.1021/cb200305u
BindingDB Entry DOI: 10.7270/Q2PV6HZG
Aurora kinase A
(Homo sapiens (Human))
BDBM86608
(Benzo[e]pyrimido[5,4-b][1,4]diazepin-6(11H)-one, 1...)
Show SMILES CN1c2ccccc2C(=O)N(C)c2cnc(Nc3ccc(OCc4ccccn4)c(Cl)c3)nc12
Show InChI InChI=1S/C25H21ClN6O2/c1-31-20-9-4-3-8-18(20)24(33)32(2)21-14-28-25(30-23(21)31)29-16-10-11-22(19(26)13-16)34-15-17-7-5-6-12-27-17/h3-14H,15H2,1-2H3,(H,28,29,30)
NCI pathway
Reactome pathway
n/an/a 53.2n/an/an/an/an/an/a
Harvard Medical School
Assay Description
In vitro kinase assay of Aurora A, B, and C using Z-LYTE technology (Invitrogen) and ATP at Km apparent for each kinase.
ACS Chem Biol 7: 185-96 (2012)
Article DOI: 10.1021/cb200305u
BindingDB Entry DOI: 10.7270/Q2PV6HZG