BDBM8746 1-[(3-methylphenyl)methyl]-4-(thiophen-3-yl)-1H-imidazole::Disubstituted imidazole 25
SMILES: Cc1cccc(Cn2cnc(c2)-c2ccsc2)c1
InChI Key: InChIKey=DERBZWWOAFEQFV-UHFFFAOYSA-N
Data: 2 IC50
Activity Spreadsheet -- Enzyme Inhibition Constant Data from BindingDB
Found 2 hits for monomerid = 8746
Trg + Lig
Ki
nM
ΔG°
kcal/mole
IC50
nM
Kd
nM
EC50/IC50
nM
koff
s-1
kon
M-1s-1
pHTemp
°C
Enoyl-ACP Reductase (FabI)
(Escherichia coli)
BDBM8746
(1-[(3-methylphenyl)methyl]-4-(thiophen-3-yl)-1H-im...)
Show SMILES Cc1cccc(Cn2cnc(c2)-c2ccsc2)c1
Show InChI InChI=1S/C15H14N2S/c1-12-3-2-4-13(7-12)8-17-9-15(16-11-17)14-5-6-18-10-14/h2-7,9-11H,8H2,1H3
n/an/a 1.22E+4n/an/an/an/an/a30
GlaxoSmithKline
Assay Description
Assays were carried out in half-area, 96-well microtiter plates. Compounds were evaluated in assay mixtures containing components specific for each e...
Bioorg Med Chem Lett 11: 2061-5 (2001)
Article DOI: 10.1016/s0960-894x(01)00404-8
BindingDB Entry DOI: 10.7270/Q28P5XQG
Enoyl-ACP Reductase (FabI)
(Staphylococcus aureus)
BDBM8746
(1-[(3-methylphenyl)methyl]-4-(thiophen-3-yl)-1H-im...)
Show SMILES Cc1cccc(Cn2cnc(c2)-c2ccsc2)c1
Show InChI InChI=1S/C15H14N2S/c1-12-3-2-4-13(7-12)8-17-9-15(16-11-17)14-5-6-18-10-14/h2-7,9-11H,8H2,1H3
n/an/a 4.24E+3n/an/an/an/a6.530
GlaxoSmithKline
Assay Description
Assays were carried out in half-area, 96-well microtiter plates. Compounds were evaluated in assay mixtures containing components specific for each e...
Bioorg Med Chem Lett 11: 2061-5 (2001)
Article DOI: 10.1016/s0960-894x(01)00404-8
BindingDB Entry DOI: 10.7270/Q28P5XQG