BDBM8749 1-benzyl-4-(4-methoxyphenyl)-1H-imidazole::Disubstituted imidazole 28
SMILES: COc1ccc(cc1)-c1cn(Cc2ccccc2)cn1
InChI Key: InChIKey=UJYVELWVAFQVEN-UHFFFAOYSA-N
Data: 2 IC50
Activity Spreadsheet -- Enzyme Inhibition Constant Data from BindingDB
Found 2 hits for monomerid = 8749
Trg + Lig
Ki
nM
ΔG°
kcal/mole
IC50
nM
Kd
nM
EC50/IC50
nM
koff
s-1
kon
M-1s-1
pHTemp
°C
Enoyl-ACP Reductase (FabI)
(Escherichia coli)
BDBM8749
(1-benzyl-4-(4-methoxyphenyl)-1H-imidazole | Disubs...)
Show SMILES COc1ccc(cc1)-c1cn(Cc2ccccc2)cn1
Show InChI InChI=1S/C17H16N2O/c1-20-16-9-7-15(8-10-16)17-12-19(13-18-17)11-14-5-3-2-4-6-14/h2-10,12-13H,11H2,1H3
n/an/a 5.28E+3n/an/an/an/an/a30
GlaxoSmithKline
Assay Description
Assays were carried out in half-area, 96-well microtiter plates. Compounds were evaluated in assay mixtures containing components specific for each e...
Bioorg Med Chem Lett 11: 2061-5 (2001)
Article DOI: 10.1016/s0960-894x(01)00404-8
BindingDB Entry DOI: 10.7270/Q28P5XQG
Enoyl-ACP Reductase (FabI)
(Staphylococcus aureus)
BDBM8749
(1-benzyl-4-(4-methoxyphenyl)-1H-imidazole | Disubs...)
Show SMILES COc1ccc(cc1)-c1cn(Cc2ccccc2)cn1
Show InChI InChI=1S/C17H16N2O/c1-20-16-9-7-15(8-10-16)17-12-19(13-18-17)11-14-5-3-2-4-6-14/h2-10,12-13H,11H2,1H3
n/an/a 1.13E+3n/an/an/an/a6.530
GlaxoSmithKline
Assay Description
Assays were carried out in half-area, 96-well microtiter plates. Compounds were evaluated in assay mixtures containing components specific for each e...
Bioorg Med Chem Lett 11: 2061-5 (2001)
Article DOI: 10.1016/s0960-894x(01)00404-8
BindingDB Entry DOI: 10.7270/Q28P5XQG