BDBM8768 1,2,3,4-Tetrahydropyrido[3,4-b]indole 12::4-({9-[(4-aminophenyl)methyl]-1H,2H,3H,4H,9H-pyrido[3,4-b]indol-2-yl}carbonyl)phenol
SMILES: Nc1ccc(Cn2c3CN(CCc3c3ccccc23)C(=O)c2ccc(O)cc2)cc1
InChI Key: InChIKey=LRPNXHZUZLOHJT-UHFFFAOYSA-N
Data: 2 IC50
PDB links: 1 PDB ID contains inhibitors having a similarity of 90% to this monomer.
Activity Spreadsheet -- Enzyme Inhibition Constant Data from BindingDB
Found 2 hits for monomerid = 8768
Trg + Lig
Ki
nM
ΔG°
kcal/mole
IC50
nM
Kd
nM
EC50/IC50
nM
koff
s-1
kon
M-1s-1
pHTemp
°C
Enoyl-ACP Reductase (FabI)
(Escherichia coli)
BDBM8768
(1,2,3,4-Tetrahydropyrido[3,4-b]indole 12 | 4-({9-[...)
Show SMILES Nc1ccc(Cn2c3CN(CCc3c3ccccc23)C(=O)c2ccc(O)cc2)cc1
Show InChI InChI=1S/C25H23N3O2/c26-19-9-5-17(6-10-19)15-28-23-4-2-1-3-21(23)22-13-14-27(16-24(22)28)25(30)18-7-11-20(29)12-8-18/h1-12,29H,13-16,26H2
n/an/a 2.14E+4n/an/an/an/an/a30
GlaxoSmithKline
Assay Description
Assays were carried out in half-area, 96-well microtiter plates. Compounds were evaluated in assay mixtures containing components specific for each e...
Bioorg Med Chem Lett 11: 2241-4 (2001)
Article DOI: 10.1016/s0960-894x(01)00405-x
BindingDB Entry DOI: 10.7270/Q24X5610
Enoyl-ACP Reductase (FabI)
(Staphylococcus aureus)
BDBM8768
(1,2,3,4-Tetrahydropyrido[3,4-b]indole 12 | 4-({9-[...)
Show SMILES Nc1ccc(Cn2c3CN(CCc3c3ccccc23)C(=O)c2ccc(O)cc2)cc1
Show InChI InChI=1S/C25H23N3O2/c26-19-9-5-17(6-10-19)15-28-23-4-2-1-3-21(23)22-13-14-27(16-24(22)28)25(30)18-7-11-20(29)12-8-18/h1-12,29H,13-16,26H2
n/an/a 670n/an/an/an/a6.530
GlaxoSmithKline
Assay Description
Assays were carried out in half-area, 96-well microtiter plates. Compounds were evaluated in assay mixtures containing components specific for each e...
Bioorg Med Chem Lett 11: 2241-4 (2001)
Article DOI: 10.1016/s0960-894x(01)00405-x
BindingDB Entry DOI: 10.7270/Q24X5610