BDBM8787 1,2,3,4-tetrahydro pyrido[3,4-b]indole 31::5-chloro-2-({9-[(4-hydroxyphenyl)methyl]-1H,2H,3H,4H,9H-pyrido[3,4-b]indol-2-yl}carbonyl)phenol
SMILES: Oc1ccc(Cn2c3CN(CCc3c3ccccc23)C(=O)c2ccc(Cl)cc2O)cc1
InChI Key: InChIKey=BATDWBFOHSRWLI-UHFFFAOYSA-N
Data: 2 IC50
PDB links: 1 PDB ID contains inhibitors having a similarity of 90% to this monomer.
Activity Spreadsheet -- Enzyme Inhibition Constant Data from BindingDB
Found 2 hits for monomerid = 8787
Trg + Lig
Ki
nM
ΔG°
kcal/mole
IC50
nM
Kd
nM
EC50/IC50
nM
koff
s-1
kon
M-1s-1
pHTemp
°C
Enoyl-ACP Reductase (FabI)
(Escherichia coli)
BDBM8787
(1,2,3,4-tetrahydro pyrido[3,4-b]indole 31 | 5-chlo...)
Show SMILES Oc1ccc(Cn2c3CN(CCc3c3ccccc23)C(=O)c2ccc(Cl)cc2O)cc1
Show InChI InChI=1S/C25H21ClN2O3/c26-17-7-10-21(24(30)13-17)25(31)27-12-11-20-19-3-1-2-4-22(19)28(23(20)15-27)14-16-5-8-18(29)9-6-16/h1-10,13,29-30H,11-12,14-15H2
n/an/a 6.10E+3n/an/an/an/an/a30
GlaxoSmithKline
Assay Description
Assays were carried out in half-area, 96-well microtiter plates. Compounds were evaluated in assay mixtures containing components specific for each e...
Bioorg Med Chem Lett 11: 2241-4 (2001)
Article DOI: 10.1016/s0960-894x(01)00405-x
BindingDB Entry DOI: 10.7270/Q24X5610
Enoyl-ACP Reductase (FabI)
(Staphylococcus aureus)
BDBM8787
(1,2,3,4-tetrahydro pyrido[3,4-b]indole 31 | 5-chlo...)
Show SMILES Oc1ccc(Cn2c3CN(CCc3c3ccccc23)C(=O)c2ccc(Cl)cc2O)cc1
Show InChI InChI=1S/C25H21ClN2O3/c26-17-7-10-21(24(30)13-17)25(31)27-12-11-20-19-3-1-2-4-22(19)28(23(20)15-27)14-16-5-8-18(29)9-6-16/h1-10,13,29-30H,11-12,14-15H2
n/an/a 160n/an/an/an/an/a30
GlaxoSmithKline
Assay Description
Assays were carried out in half-area, 96-well microtiter plates. Compounds were evaluated in assay mixtures containing components specific for each e...
Bioorg Med Chem Lett 11: 2241-4 (2001)
Article DOI: 10.1016/s0960-894x(01)00405-x
BindingDB Entry DOI: 10.7270/Q24X5610