null
SMILES: COc1cccc(NC(=O)CSC(N)=O)c1
InChI Key: InChIKey=UEVAUASSEQCPCW-UHFFFAOYSA-N
Activity Spreadsheet -- Enzyme Inhibition Constant Data from BindingDB
Found 1 hit for monomerid = 87885
Trg + Lig
Ki
nM
ΔG°
kcal/mole
IC50
nM
Kd
nM
EC50/IC50
nM
koff
s-1
kon
M-1s-1
pHTemp
°C
Methionine--tRNA ligase
(Trypanosoma brucei brucei strain 927/4 GUTat10.1)
BDBM87885
(MLS000700267 | S-[2-(3-methoxyanilino)-2-oxoethyl]...)
Show SMILES COc1cccc(NC(=O)CSC(N)=O)c1
Show InChI InChI=1S/C10H12N2O3S/c1-15-8-4-2-3-7(5-8)12-9(13)6-16-10(11)14/h2-5H,6H2,1H3,(H2,11,14)(H,12,13)
PCBioAssay
n/an/a 1.57E+3n/an/an/an/an/an/a
The Scripps Research Institute Molecular Screening Center
Curated by PubChem BioAssay
PubChem Bioassay (2013)
BindingDB Entry DOI: 10.7270/Q2XP73JZ