BDBM88276 US9695118, 707
SMILES: CCS(=O)(=O)c1ccc(Cl)cc1CNC(=O)c1cc(Cl)c(CN2CCCC3(CCCCN3)C2)c(c1)C(F)(F)F
InChI Key: InChIKey=CGGBEQCACMMNKA-UHFFFAOYSA-N
Data: 1 IC50
Activity Spreadsheet -- Enzyme Inhibition Constant Data from BindingDB
Found 1 hit for monomerid = 88276
Trg + Lig
Ki
nM
ΔG°
kcal/mole
IC50
nM
Kd
nM
EC50/IC50
nM
koff
s-1
kon
M-1s-1
pHTemp
°C
Epithelial discoidin domain-containing receptor 1
(Homo sapiens (Human))
BDBM88276
(US9695118, 707)
Show SMILES CCS(=O)(=O)c1ccc(Cl)cc1CNC(=O)c1cc(Cl)c(CN2CCCC3(CCCCN3)C2)c(c1)C(F)(F)F
Show InChI InChI=1S/C27H32Cl2F3N3O3S/c1-2-39(37,38)24-7-6-20(28)12-19(24)15-33-25(36)18-13-22(27(30,31)32)21(23(29)14-18)16-35-11-5-9-26(17-35)8-3-4-10-34-26/h6-7,12-14,34H,2-5,8-11,15-17H2,1H3,(H,33,36)
US Patent
n/an/a 10n/an/an/an/an/a25
Chugai Seiyaku Kabushiki Kaisha
US Patent
Assay Description
DDR1 binding activity was measured by the LanthaScreen (Registered trademark) Eu Kinase Binding Assay (manufactured by Life Technologies Corporation)...
US Patent US9695118 (2017)
BindingDB Entry DOI: 10.7270/Q2736P1T