BDBM89137 2-furfuryl-(2-piperidinoquinazolin-4-yl)amine;hydrochloride::Furan-2-ylmethyl-(2-piperidin-1-yl-quinazolin-4-yl)-amine::MLS000026849::N-(2-furanylmethyl)-2-(1-piperidinyl)-4-quinazolinamine;hydrochloride::N-(furan-2-ylmethyl)-2-piperidin-1-yl-quinazolin-4-amine;hydrochloride::N-(furan-2-ylmethyl)-2-piperidin-1-ylquinazolin-4-amine;hydrochloride::SMR000012263::cid_6602565
SMILES: C(Nc1nc(nc2ccccc12)N1CCCCC1)c1ccco1
InChI Key: InChIKey=SRTQBUDNFLRBKO-UHFFFAOYSA-N
Data: 1 EC50
Activity Spreadsheet -- Enzyme Inhibition Constant Data from BindingDB
Found 1 hit for monomerid = 89137
Trg + Lig
Ki
nM
ΔG°
kcal/mole
IC50
nM
Kd
nM
EC50/IC50
nM
koff
s-1
kon
M-1s-1
pHTemp
°C
High-affinity choline transporter
(Homo sapiens (Human))
BDBM89137
(2-furfuryl-(2-piperidinoquinazolin-4-yl)amine;hydr...)
Show SMILES C(Nc1nc(nc2ccccc12)N1CCCCC1)c1ccco1
Show InChI InChI=1S/C18H20N4O/c1-4-10-22(11-5-1)18-20-16-9-3-2-8-15(16)17(21-18)19-13-14-7-6-12-23-14/h2-3,6-9,12H,1,4-5,10-11,13H2,(H,19,20,21)
Reactome pathway
PCBioAssay
n/an/an/an/a 1.79E+3n/an/an/an/a
Johns Hopkins Ion Channel Center
Curated by PubChem BioAssay
Assay Description
Data Source (MLPCN Center Name): Johns Hopkins Ion Channel Center (JHICC) Center Affiliation: Johns Hopkins University, School of Medicine Screening ...
PubChem Bioassay (2012)
BindingDB Entry DOI: 10.7270/Q21N7ZQ4