BDBM89350 7-(2,4-dichlorobenzyl)-8-(2-furfurylamino)-1,3-dimethyl-xanthine::7-[(2,4-dichlorophenyl)methyl]-8-(2-furanylmethylamino)-1,3-dimethylpurine-2,6-dione::7-[(2,4-dichlorophenyl)methyl]-8-(furan-2-ylmethylamino)-1,3-dimethyl-purine-2,6-dione::7-[(2,4-dichlorophenyl)methyl]-8-(furan-2-ylmethylamino)-1,3-dimethylpurine-2,6-dione::MLS000830306::SMR000035471::cid_657771
SMILES: Cn1c2nc(NCc3ccco3)n(Cc3ccc(Cl)cc3Cl)c2c(=O)n(C)c1=O
InChI Key: InChIKey=JKUYJRTWWHJEFW-UHFFFAOYSA-N
Data: 2 IC50
Activity Spreadsheet -- Enzyme Inhibition Constant Data from BindingDB
Found 2 hits for monomerid = 89350
Trg + Lig
Ki
nM
ΔG°
kcal/mole
IC50
nM
Kd
nM
EC50/IC50
nM
koff
s-1
kon
M-1s-1
pHTemp
°C
Protein Wnt-3a
(Mus musculus)
BDBM89350
(7-(2,4-dichlorobenzyl)-8-(2-furfurylamino)-1,3-dim...)
Show SMILES Cn1c2nc(NCc3ccco3)n(Cc3ccc(Cl)cc3Cl)c2c(=O)n(C)c1=O
Show InChI InChI=1S/C19H17Cl2N5O3/c1-24-16-15(17(27)25(2)19(24)28)26(10-11-5-6-12(20)8-14(11)21)18(23-16)22-9-13-4-3-7-29-13/h3-8H,9-10H2,1-2H3,(H,22,23)
Reactome pathway
PCBioAssay
n/an/a 1.94E+3n/an/an/an/an/an/a
Burnham Center for Chemical Genomics
Curated by PubChem BioAssay
PubChem Bioassay (2012)
BindingDB Entry DOI: 10.7270/Q25B012X
Zinc finger protein GLI1
(Mus musculus)
BDBM89350
(7-(2,4-dichlorobenzyl)-8-(2-furfurylamino)-1,3-dim...)
Show SMILES Cn1c2nc(NCc3ccco3)n(Cc3ccc(Cl)cc3Cl)c2c(=O)n(C)c1=O
Show InChI InChI=1S/C19H17Cl2N5O3/c1-24-16-15(17(27)25(2)19(24)28)26(10-11-5-6-12(20)8-14(11)21)18(23-16)22-9-13-4-3-7-29-13/h3-8H,9-10H2,1-2H3,(H,22,23)
PCBioAssay
n/an/a 647n/an/an/an/an/an/a
Burnham Center for Chemical Genomics
Curated by PubChem BioAssay
Assay Description
Data Source: Sanford-Burnham Center for Chemical Genomics (SBCCG) Source Affiliation: Sanford-Burnham Medical Research Institute (SBMRI, San Diego, C...
PubChem Bioassay (2012)
BindingDB Entry DOI: 10.7270/Q2862F26