BDBM89530 2-(5-Phenyl-[1,3,4]oxadiazol-2-yl)-benzo[f]chromen-3-one::2-(5-phenyl-1,3,4-oxadiazol-2-yl)-3-benzo[f][1]benzopyranone::2-(5-phenyl-1,3,4-oxadiazol-2-yl)benzo[f]chromen-3-one::MLS000029448::SMR000009798::cid_650811
SMILES: O=c1oc2ccc3ccccc3c2cc1-c1nnc(o1)-c1ccccc1
InChI Key: InChIKey=VIUMSGOHJAGSFZ-UHFFFAOYSA-N
Data: 1 IC50  1 EC50
Activity Spreadsheet -- Enzyme Inhibition Constant Data from BindingDB
Found 2 hits for monomerid = 89530
Trg + Lig
Ki
nM
ΔG°
kcal/mole
IC50
nM
Kd
nM
EC50/IC50
nM
koff
s-1
kon
M-1s-1
pHTemp
°C
corticotropin releasing factor-binding protein
(Homo sapiens (Human))
BDBM89530
(2-(5-Phenyl-[1,3,4]oxadiazol-2-yl)-benzo[f]chromen...)
Show SMILES O=c1oc2ccc3ccccc3c2cc1-c1nnc(o1)-c1ccccc1
Show InChI InChI=1S/C21H12N2O3/c24-21-17(20-23-22-19(26-20)14-7-2-1-3-8-14)12-16-15-9-5-4-6-13(15)10-11-18(16)25-21/h1-12H
PCBioAssay
n/an/a 390n/an/an/an/an/an/a
Burnham Center for Chemical Genomics
Curated by PubChem BioAssay
PubChem Bioassay (2012)
BindingDB Entry DOI: 10.7270/Q2NC5ZS3
corticotropin releasing factor-binding protein
(Homo sapiens (Human))
BDBM89530
(2-(5-Phenyl-[1,3,4]oxadiazol-2-yl)-benzo[f]chromen...)
Show SMILES O=c1oc2ccc3ccccc3c2cc1-c1nnc(o1)-c1ccccc1
Show InChI InChI=1S/C21H12N2O3/c24-21-17(20-23-22-19(26-20)14-7-2-1-3-8-14)12-16-15-9-5-4-6-13(15)10-11-18(16)25-21/h1-12H
PCBioAssay
n/an/an/an/a>5.30E+4n/an/an/an/a
Burnham Center for Chemical Genomics
Curated by PubChem BioAssay
Assay Description
Data Source: Sanford-Burnham Center for Chemical Genomics (SBCCG) Source Affiliation: Sanford-Burnham Medical Research Institute (SBMRI, San Diego, C...
PubChem Bioassay (2012)
BindingDB Entry DOI: 10.7270/Q2VX0F3D