BDBM90032 2-({5-[(2-ethoxy-4-methylphenoxy)methyl]-4-methyl-4H-1,2,4-triazol-3-yl}thio)-1-(3-nitrophenyl)ethanone::2-[[5-[(2-ethoxy-4-methyl-phenoxy)methyl]-4-methyl-1,2,4-triazol-3-yl]sulfanyl]-1-(3-nitrophenyl)ethanone::2-[[5-[(2-ethoxy-4-methyl-phenoxy)methyl]-4-methyl-1,2,4-triazol-3-yl]thio]-1-(3-nitrophenyl)ethanone::2-[[5-[(2-ethoxy-4-methylphenoxy)methyl]-4-methyl-1,2,4-triazol-3-yl]sulfanyl]-1-(3-nitrophenyl)ethanone::2-[[5-[(2-ethoxy-4-methylphenoxy)methyl]-4-methyl-1,2,4-triazol-3-yl]thio]-1-(3-nitrophenyl)ethanone::MLS000582025::SMR000201238::cid_1251011
SMILES: CCOc1cc(C)ccc1OCc1nnc(SCC(=O)c2cccc(c2)[N+]([O-])=O)n1C
InChI Key: InChIKey=IQNSDHRDTNIKGU-UHFFFAOYSA-N
Data: 1 IC50  1 EC50
Activity Spreadsheet -- Enzyme Inhibition Constant Data from BindingDB
Found 2 hits for monomerid = 90032
Trg + Lig
Ki
nM
ΔG°
kcal/mole
IC50
nM
Kd
nM
EC50/IC50
nM
koff
s-1
kon
M-1s-1
pHTemp
°C
corticotropin releasing factor-binding protein
(Homo sapiens (Human))
BDBM90032
(2-({5-[(2-ethoxy-4-methylphenoxy)methyl]-4-methyl-...)
Show SMILES CCOc1cc(C)ccc1OCc1nnc(SCC(=O)c2cccc(c2)[N+]([O-])=O)n1C
Show InChI InChI=1S/C21H22N4O5S/c1-4-29-19-10-14(2)8-9-18(19)30-12-20-22-23-21(24(20)3)31-13-17(26)15-6-5-7-16(11-15)25(27)28/h5-11H,4,12-13H2,1-3H3
PCBioAssay
n/an/a 2.11E+3n/an/an/an/an/an/a
Burnham Center for Chemical Genomics
Curated by PubChem BioAssay
PubChem Bioassay (2012)
BindingDB Entry DOI: 10.7270/Q2NC5ZS3
corticotropin releasing factor-binding protein
(Homo sapiens (Human))
BDBM90032
(2-({5-[(2-ethoxy-4-methylphenoxy)methyl]-4-methyl-...)
Show SMILES CCOc1cc(C)ccc1OCc1nnc(SCC(=O)c2cccc(c2)[N+]([O-])=O)n1C
Show InChI InChI=1S/C21H22N4O5S/c1-4-29-19-10-14(2)8-9-18(19)30-12-20-22-23-21(24(20)3)31-13-17(26)15-6-5-7-16(11-15)25(27)28/h5-11H,4,12-13H2,1-3H3
PCBioAssay
n/an/an/an/a>5.30E+4n/an/an/an/a
Burnham Center for Chemical Genomics
Curated by PubChem BioAssay
Assay Description
Data Source: Sanford-Burnham Center for Chemical Genomics (SBCCG) Source Affiliation: Sanford-Burnham Medical Research Institute (SBMRI, San Diego, C...
PubChem Bioassay (2012)
BindingDB Entry DOI: 10.7270/Q2VX0F3D