BDBM90034 4-(2-furanylmethylamino)-3-nitrobenzamide::4-(2-furfurylamino)-3-nitro-benzamide::4-(furan-2-ylmethylamino)-3-nitro-benzamide::4-(furan-2-ylmethylamino)-3-nitrobenzamide::4-[(2-furylmethyl)amino]-3-nitrobenzamide::MLS000574229::SMR000195820::cid_2907140
SMILES: NC(=O)c1ccc(NCc2ccco2)c(c1)[N+]([O-])=O
InChI Key: InChIKey=MJYYELMTGSJDCZ-UHFFFAOYSA-N
Data: 1 IC50  1 EC50
Activity Spreadsheet -- Enzyme Inhibition Constant Data from BindingDB
Found 2 hits for monomerid = 90034
Trg + Lig
Ki
nM
ΔG°
kcal/mole
IC50
nM
Kd
nM
EC50/IC50
nM
koff
s-1
kon
M-1s-1
pHTemp
°C
corticotropin releasing factor-binding protein
(Homo sapiens (Human))
BDBM90034
(4-(2-furanylmethylamino)-3-nitrobenzamide | 4-(2-f...)
Show SMILES NC(=O)c1ccc(NCc2ccco2)c(c1)[N+]([O-])=O
Show InChI InChI=1S/C12H11N3O4/c13-12(16)8-3-4-10(11(6-8)15(17)18)14-7-9-2-1-5-19-9/h1-6,14H,7H2,(H2,13,16)
PCBioAssay
n/an/a 3.57E+3n/an/an/an/an/an/a
Burnham Center for Chemical Genomics
Curated by PubChem BioAssay
PubChem Bioassay (2012)
BindingDB Entry DOI: 10.7270/Q2NC5ZS3
corticotropin releasing factor-binding protein
(Homo sapiens (Human))
BDBM90034
(4-(2-furanylmethylamino)-3-nitrobenzamide | 4-(2-f...)
Show SMILES NC(=O)c1ccc(NCc2ccco2)c(c1)[N+]([O-])=O
Show InChI InChI=1S/C12H11N3O4/c13-12(16)8-3-4-10(11(6-8)15(17)18)14-7-9-2-1-5-19-9/h1-6,14H,7H2,(H2,13,16)
PCBioAssay
n/an/an/an/a>5.30E+4n/an/an/an/a
Burnham Center for Chemical Genomics
Curated by PubChem BioAssay
Assay Description
Data Source: Sanford-Burnham Center for Chemical Genomics (SBCCG) Source Affiliation: Sanford-Burnham Medical Research Institute (SBMRI, San Diego, C...
PubChem Bioassay (2012)
BindingDB Entry DOI: 10.7270/Q2VX0F3D