BDBM9008 6-(6-Chloro-1,2,3,4-tetrahydro-acridin-9-ylamino)-hexanoic acid [2-(1H-indol-3-yl)-ethyl]-amide::6-[(6-chloro-1,2,3,4-tetrahydroacridin-9-yl)amino]-N-[2-(1H-indol-3-yl)ethyl]hexanamide::Tacrine-Melatonin Hybrid 4a
SMILES: Clc1ccc2c(NCCCCCC(=O)NCCc3c[nH]c4ccccc34)c3CCCCc3nc2c1
InChI Key: InChIKey=ADKBJCKYNXBIRF-UHFFFAOYSA-N
Data: 3 IC50
Activity Spreadsheet -- Enzyme Inhibition Constant Data from BindingDB
Found 3 hits for monomerid = 9008
Trg + Lig
Ki
nM
ΔG°
kcal/mole
IC50
nM
Kd
nM
EC50/IC50
nM
koff
s-1
kon
M-1s-1
pHTemp
°C
Acetylcholinesterase
(Bos taurus (bovine))
BDBM9008
(6-(6-Chloro-1,2,3,4-tetrahydro-acridin-9-ylamino)-...)
Show SMILES Clc1ccc2c(NCCCCCC(=O)NCCc3c[nH]c4ccccc34)c3CCCCc3nc2c1
Show InChI InChI=1S/C29H33ClN4O/c30-21-13-14-24-27(18-21)34-26-11-6-4-9-23(26)29(24)32-16-7-1-2-12-28(35)31-17-15-20-19-33-25-10-5-3-8-22(20)25/h3,5,8,10,13-14,18-19,33H,1-2,4,6-7,9,11-12,15-17H2,(H,31,35)(H,32,34)
Reactome pathway
n/an/a 2n/an/an/an/a8.030
Instituto de Quimica Medica (CSIC)
Assay Description
The cholinesterase assays were performed using colorimetric method reported by Ellman. The absorbance changes at 412 nm were recorded for 5 min with ...
J Med Chem 49: 459-62 (2006)
Article DOI: 10.1021/jm050746d
BindingDB Entry DOI: 10.7270/Q2VD6WN2
Acetylcholinesterase
(Homo sapiens (Human))
BDBM9008
(6-(6-Chloro-1,2,3,4-tetrahydro-acridin-9-ylamino)-...)
Show SMILES Clc1ccc2c(NCCCCCC(=O)NCCc3c[nH]c4ccccc34)c3CCCCc3nc2c1
Show InChI InChI=1S/C29H33ClN4O/c30-21-13-14-24-27(18-21)34-26-11-6-4-9-23(26)29(24)32-16-7-1-2-12-28(35)31-17-15-20-19-33-25-10-5-3-8-22(20)25/h3,5,8,10,13-14,18-19,33H,1-2,4,6-7,9,11-12,15-17H2,(H,31,35)(H,32,34)
NCI pathway
Reactome pathway
n/an/a 0.00500n/an/an/an/an/an/a
CSIR-Central Drug Research Institute
Curated by ChEMBL
Assay Description
Inhibition of human erythrocyte acetylcholinesterase using acetylthiocholine as substrate by Ellman's method
Bioorg Med Chem 27: 895-930 (2019)
Article DOI: 10.1016/j.bmc.2019.01.025
Butyrylcholinesterase (BChE)
(Equus caballus (Horse))
BDBM9008
(6-(6-Chloro-1,2,3,4-tetrahydro-acridin-9-ylamino)-...)
Show SMILES Clc1ccc2c(NCCCCCC(=O)NCCc3c[nH]c4ccccc34)c3CCCCc3nc2c1
Show InChI InChI=1S/C29H33ClN4O/c30-21-13-14-24-27(18-21)34-26-11-6-4-9-23(26)29(24)32-16-7-1-2-12-28(35)31-17-15-20-19-33-25-10-5-3-8-22(20)25/h3,5,8,10,13-14,18-19,33H,1-2,4,6-7,9,11-12,15-17H2,(H,31,35)(H,32,34)
n/an/a 5.20n/an/an/an/an/an/a
Instituto de Quimica Medica (CSIC)
Assay Description
The cholinesterase assays were performed using colorimetric method reported by Ellman. The absorbance changes at 412 nm were recorded for 5 min with ...
J Med Chem 49: 459-62 (2006)
Article DOI: 10.1021/jm050746d
BindingDB Entry DOI: 10.7270/Q2VD6WN2