BDBM90892 2-(4-chlorophenyl)sulfanyl-3-nitro-pyridine::2-(4-chlorophenyl)sulfanyl-3-nitropyridine::2-[(4-chlorophenyl)thio]-3-nitro-pyridine::2-[(4-chlorophenyl)thio]-3-nitropyridine::MLS001181424::SMR000567168::cid_2774370
SMILES: [O-][N+](=O)c1cccnc1Sc1ccc(Cl)cc1
InChI Key: InChIKey=ANCQATHISNEWKS-UHFFFAOYSA-N
Data: 1 IC50  1 EC50
Activity Spreadsheet -- Enzyme Inhibition Constant Data from BindingDB
Found 2 hits for monomerid = 90892
Trg + Lig
Ki
nM
ΔG°
kcal/mole
IC50
nM
Kd
nM
EC50/IC50
nM
koff
s-1
kon
M-1s-1
pHTemp
°C
corticotropin releasing factor-binding protein
(Homo sapiens (Human))
BDBM90892
(2-(4-chlorophenyl)sulfanyl-3-nitro-pyridine | 2-(4...)
Show SMILES [O-][N+](=O)c1cccnc1Sc1ccc(Cl)cc1
Show InChI InChI=1S/C11H7ClN2O2S/c12-8-3-5-9(6-4-8)17-11-10(14(15)16)2-1-7-13-11/h1-7H
PCBioAssay
n/an/a 3.10E+3n/an/an/an/an/an/a
Burnham Center for Chemical Genomics
Curated by PubChem BioAssay
PubChem Bioassay (2012)
BindingDB Entry DOI: 10.7270/Q2NC5ZS3
corticotropin releasing factor-binding protein
(Homo sapiens (Human))
BDBM90892
(2-(4-chlorophenyl)sulfanyl-3-nitro-pyridine | 2-(4...)
Show SMILES [O-][N+](=O)c1cccnc1Sc1ccc(Cl)cc1
Show InChI InChI=1S/C11H7ClN2O2S/c12-8-3-5-9(6-4-8)17-11-10(14(15)16)2-1-7-13-11/h1-7H
PCBioAssay
n/an/an/an/a>5.30E+4n/an/an/an/a
Burnham Center for Chemical Genomics
Curated by PubChem BioAssay
Assay Description
Data Source: Sanford-Burnham Center for Chemical Genomics (SBCCG) Source Affiliation: Sanford-Burnham Medical Research Institute (SBMRI, San Diego, C...
PubChem Bioassay (2012)
BindingDB Entry DOI: 10.7270/Q2VX0F3D