BDBM9097 (2S)-4-{2-[5-(4-chlorophenyl)-1,3-oxazol-2-yl]propan-2-yl}-1-[(2S,4S)-4-{furo[2,3-c]pyridin-2-ylmethyl}-2-hydroxy-4-{[(3S,4S)-3-hydroxy-3,4-dihydro-2H-1-benzopyran-4-yl]carbamoyl}butyl]-N-(2,2,2-trifluoroethyl)piperazine-2-carboxamide::pyridylfuran analog 15
SMILES: CC(C)(N1CCN(C[C@@H](O)C[C@@H](Cc2cc3ccncc3o2)C(=O)N[C@@H]2[C@H](O)COc3ccccc23)[C@@H](C1)C(=O)NCC(F)(F)F)c1ncc(o1)-c1ccc(Cl)cc1
InChI Key: InChIKey=JBMUJPIOBHXTBM-KCMFSSCLSA-N
Data: 1 IC50
Activity Spreadsheet -- Enzyme Inhibition Constant Data from BindingDB
Found 1 hit for monomerid = 9097
Trg + Lig
Ki
nM
ΔG°
kcal/mole
IC50
nM
Kd
nM
EC50/IC50
nM
koff
s-1
kon
M-1s-1
pHTemp
°C
HIV-1 Protease
(Human immunodeficiency virus type 1)
BDBM9097
((2S)-4-{2-[5-(4-chlorophenyl)-1,3-oxazol-2-yl]prop...)
Show SMILES CC(C)(N1CCN(C[C@@H](O)C[C@@H](Cc2cc3ccncc3o2)C(=O)N[C@@H]2[C@H](O)COc3ccccc23)[C@@H](C1)C(=O)NCC(F)(F)F)c1ncc(o1)-c1ccc(Cl)cc1 |r|
Show InChI InChI=1S/C41H44ClF3N6O7/c1-40(2,39-47-19-35(58-39)24-7-9-27(42)10-8-24)51-14-13-50(31(21-51)38(55)48-23-41(43,44)45)20-28(52)15-26(17-29-16-25-11-12-46-18-34(25)57-29)37(54)49-36-30-5-3-4-6-33(30)56-22-32(36)53/h3-12,16,18-19,26,28,31-32,36,52-53H,13-15,17,20-23H2,1-2H3,(H,48,55)(H,49,54)/t26-,28-,31-,32+,36-/m0/s1
n/an/a 0.0200n/an/an/an/a5.530
Merck Research Laboratories
Assay Description
Assay of HIV protease inhibition was performed by peptide cleavage using the substrate Val-Ser-Gln-Asn-beta-naphthylalanine*Pro-Ile-Val. Products of ...
Bioorg Med Chem Lett 15: 5311-4 (2005)
Article DOI: 10.1016/j.bmcl.2005.08.072
BindingDB Entry DOI: 10.7270/Q26Q1VF8