BDBM9101 (2S)-4-{[5-(4-chlorophenyl)furan-2-yl]methyl}-1-[(2S,4S)-2-hydroxy-4-{[(3S,4S)-3-hydroxy-3,4-dihydro-2H-1-benzopyran-4-yl]carbamoyl}-4-{[5-(4-methylpyridin-3-yl)furan-2-yl]methyl}butyl]-N-(2,2,2-trifluoroethyl)piperazine-2-carboxamide::3-(5-methyl-2-furyl)-4-methylpyridine analog 19
SMILES: Cc1ccncc1-c1ccc(C[C@H](C[C@H](O)CN2CCN(Cc3ccc(o3)-c3ccc(Cl)cc3)C[C@H]2C(=O)NCC(F)(F)F)C(=O)N[C@@H]2[C@H](O)COc3ccccc23)o1
InChI Key: InChIKey=NUZHSQZGCWZLGP-NWPKOSFFSA-N
Data: 1 IC50
Activity Spreadsheet -- Enzyme Inhibition Constant Data from BindingDB
Found 1 hit for monomerid = 9101
Trg + Lig
Ki
nM
ΔG°
kcal/mole
IC50
nM
Kd
nM
EC50/IC50
nM
koff
s-1
kon
M-1s-1
pHTemp
°C
HIV-1 Protease
(Human immunodeficiency virus type 1)
BDBM9101
((2S)-4-{[5-(4-chlorophenyl)furan-2-yl]methyl}-1-[(...)
Show SMILES Cc1ccncc1-c1ccc(C[C@H](C[C@H](O)CN2CCN(Cc3ccc(o3)-c3ccc(Cl)cc3)C[C@H]2C(=O)NCC(F)(F)F)C(=O)N[C@@H]2[C@H](O)COc3ccccc23)o1 |r|
Show InChI InChI=1S/C43H45ClF3N5O7/c1-26-14-15-48-20-34(26)39-13-10-31(58-39)19-28(41(55)50-40-33-4-2-3-5-38(33)57-24-36(40)54)18-30(53)21-52-17-16-51(23-35(52)42(56)49-25-43(45,46)47)22-32-11-12-37(59-32)27-6-8-29(44)9-7-27/h2-15,20,28,30,35-36,40,53-54H,16-19,21-25H2,1H3,(H,49,56)(H,50,55)/t28-,30-,35-,36+,40-/m0/s1
n/an/a 0.0800n/an/an/an/a5.530
Merck Research Laboratories
Assay Description
Assay of HIV protease inhibition was performed by peptide cleavage using the substrate Val-Ser-Gln-Asn-beta-naphthylalanine*Pro-Ile-Val. Products of ...
Bioorg Med Chem Lett 15: 5311-4 (2005)
Article DOI: 10.1016/j.bmcl.2005.08.072
BindingDB Entry DOI: 10.7270/Q26Q1VF8