BDBM9120 (2S)-1-[(2S,4S)-2-hydroxy-4-{[(3S,4S)-3-hydroxy-3,4-dihydro-2H-1-benzopyran-4-yl]carbamoyl}-4-[(5-phenyl-1,3,4-oxadiazol-2-yl)methyl]butyl]-4-{2-[5-(5-methoxypyridin-3-yl)-1,3-oxazol-2-yl]propan-2-yl}-N-(2,2,2-trifluoroethyl)piperazine-2-carboxamide::1,3,4-oxadiazole analog 28
SMILES: COc1cncc(c1)-c1cnc(o1)C(C)(C)N1CCN(C[C@@H](O)C[C@@H](Cc2nnc(o2)-c2ccccc2)C(=O)N[C@@H]2[C@H](O)COc3ccccc23)[C@@H](C1)C(=O)NCC(F)(F)F
InChI Key: InChIKey=QAWJSYUSNVBIAR-KCMFSSCLSA-N
Data: 1 IC50
Activity Spreadsheet -- Enzyme Inhibition Constant Data from BindingDB
Found 1 hit for monomerid = 9120
Trg + Lig
Ki
nM
ΔG°
kcal/mole
IC50
nM
Kd
nM
EC50/IC50
nM
koff
s-1
kon
M-1s-1
pHTemp
°C
HIV-1 Protease
(Human immunodeficiency virus type 1)
BDBM9120
((2S)-1-[(2S,4S)-2-hydroxy-4-{[(3S,4S)-3-hydroxy-3,...)
Show SMILES COc1cncc(c1)-c1cnc(o1)C(C)(C)N1CCN(C[C@@H](O)C[C@@H](Cc2nnc(o2)-c2ccccc2)C(=O)N[C@@H]2[C@H](O)COc3ccccc23)[C@@H](C1)C(=O)NCC(F)(F)F |r|
Show InChI InChI=1S/C42H47F3N8O8/c1-41(2,40-47-20-34(60-40)27-16-29(58-3)19-46-18-27)53-14-13-52(31(22-53)38(57)48-24-42(43,44)45)21-28(54)15-26(17-35-50-51-39(61-35)25-9-5-4-6-10-25)37(56)49-36-30-11-7-8-12-33(30)59-23-32(36)55/h4-12,16,18-20,26,28,31-32,36,54-55H,13-15,17,21-24H2,1-3H3,(H,48,57)(H,49,56)/t26-,28-,31-,32+,36-/m0/s1
n/an/a 0.480n/an/an/an/a5.530
Merck Research Laboratories
Assay Description
Assay of HIV protease inhibition was performed by peptide cleavage using the substrate Val-Ser-Gln-Asn-beta-naphthylalanine*Pro-Ile-Val. Products of ...
Bioorg Med Chem Lett 14: 4651-4 (2004)
Article DOI: 10.1016/j.bmcl.2004.06.092
BindingDB Entry DOI: 10.7270/Q22Z13QX