BDBM9162 N-alkoxysulfonamide analog 2::N-alkoxysulfonamide analog entry b::tert-butyl N-[(2S,3R)-3-hydroxy-4-[(4-methoxybenzene)(pentan-3-yloxy)sulfonamido]-1-phenylbutan-2-yl]carbamate
SMILES: CCC(CC)ON(C[C@@H](O)[C@H](Cc1ccccc1)NC(=O)OC(C)(C)C)S(=O)(=O)c1ccc(OC)cc1
InChI Key: InChIKey=KBIPGDRYFVMXGQ-LOSJGSFVSA-N
Data: 1 KI
Activity Spreadsheet -- Enzyme Inhibition Constant Data from BindingDB
Found 1 hit for monomerid = 9162
Trg + Lig
Ki
nM
ΔG°
kcal/mole
IC50
nM
Kd
nM
EC50/IC50
nM
koff
s-1
kon
M-1s-1
pHTemp
°C
HIV-1 Protease
(Human immunodeficiency virus type 1)
BDBM9162
(N-alkoxysulfonamide analog 2 | N-alkoxysulfonamide...)
Show SMILES CCC(CC)ON(C[C@@H](O)[C@H](Cc1ccccc1)NC(=O)OC(C)(C)C)S(=O)(=O)c1ccc(OC)cc1 |r|
Show InChI InChI=1S/C27H40N2O7S/c1-7-21(8-2)36-29(37(32,33)23-16-14-22(34-6)15-17-23)19-25(30)24(18-20-12-10-9-11-13-20)28-26(31)35-27(3,4)5/h9-17,21,24-25,30H,7-8,18-19H2,1-6H3,(H,28,31)/t24-,25+/m0/s1
3.20 -11.6n/an/an/an/an/a6.825
GlaxoSmithKline
Assay Description
The Ki values were determined using fluorogenic substrate, 2-(aminobenzoyl)-Thr-Ile-Nle-Phe(p-NO2)-Gln-ArgNH2. A standard curve relating changes in f...
Bioorg Med Chem Lett 15: 3560-4 (2005)
Article DOI: 10.1016/j.bmcl.2005.05.101
BindingDB Entry DOI: 10.7270/Q2F769SC