BDBM9163 N-alkoxysulfonamide analog 3::N-alkoxysulfonamide analog entry c::tert-butyl N-[(2S,3R)-3-hydroxy-4-[(4-methoxybenzene)(2-methylpropoxy)sulfonamido]-1-phenylbutan-2-yl]carbamate
SMILES: COc1ccc(cc1)S(=O)(=O)N(C[C@@H](O)[C@H](Cc1ccccc1)NC(=O)OC(C)(C)C)OCC(C)C
InChI Key: InChIKey=ZMTSUDMDVPYUFD-BJKOFHAPSA-N
Data: 1 KI
Activity Spreadsheet -- Enzyme Inhibition Constant Data from BindingDB
Found 1 hit for monomerid = 9163
Trg + Lig
Ki
nM
ΔG°
kcal/mole
IC50
nM
Kd
nM
EC50/IC50
nM
koff
s-1
kon
M-1s-1
pHTemp
°C
HIV-1 Protease
(Human immunodeficiency virus type 1)
BDBM9163
(N-alkoxysulfonamide analog 3 | N-alkoxysulfonamide...)
Show SMILES COc1ccc(cc1)S(=O)(=O)N(C[C@@H](O)[C@H](Cc1ccccc1)NC(=O)OC(C)(C)C)OCC(C)C |r|
Show InChI InChI=1S/C26H38N2O7S/c1-19(2)18-34-28(36(31,32)22-14-12-21(33-6)13-15-22)17-24(29)23(16-20-10-8-7-9-11-20)27-25(30)35-26(3,4)5/h7-15,19,23-24,29H,16-18H2,1-6H3,(H,27,30)/t23-,24+/m0/s1
4 -11.4n/an/an/an/an/a6.825
GlaxoSmithKline
Assay Description
The Ki values were determined using fluorogenic substrate, 2-(aminobenzoyl)-Thr-Ile-Nle-Phe(p-NO2)-Gln-ArgNH2. A standard curve relating changes in f...
Bioorg Med Chem Lett 15: 3560-4 (2005)
Article DOI: 10.1016/j.bmcl.2005.05.101
BindingDB Entry DOI: 10.7270/Q2F769SC