BDBM91703 Oxazolamine derivative, 5f
SMILES: Oc1ccc(cc1)C(c1ccc(Nc2nc3ccccc3o2)cc1)n1ccnc1
InChI Key: InChIKey=RANAONQXHNMZQO-UHFFFAOYSA-N
Data: 1 EC50
Activity Spreadsheet -- Enzyme Inhibition Constant Data from BindingDB
Found 1 hit for monomerid = 91703
Trg + Lig
Ki
nM
ΔG°
kcal/mole
IC50
nM
Kd
nM
EC50/IC50
nM
koff
s-1
kon
M-1s-1
pHTemp
°C
Cytochrome CYP26A1
(Homo sapiens (Human))
BDBM91703
(Oxazolamine derivative, 5f)
Show SMILES Oc1ccc(cc1)C(c1ccc(Nc2nc3ccccc3o2)cc1)n1ccnc1
Show InChI InChI=1S/C23H18N4O2/c28-19-11-7-17(8-12-19)22(27-14-13-24-15-27)16-5-9-18(10-6-16)25-23-26-20-3-1-2-4-21(20)29-23/h1-15,22,28H,(H,25,26)
Reactome pathway
n/an/an/an/a 1.20E+4n/an/an/an/a
Cardiff University
Assay Description
The imidazole derivatives were evaluated for their retinoic acid metabolism inhibitory activity using a MCF-7 cell assay, using radiolabelled all-tra...
J Enzyme Inhib Med Chem 24: 487-98 (2009)
Article DOI: 10.1080/14756360802218334
BindingDB Entry DOI: 10.7270/Q2CR5RZ5