BDBM91719 1-Dehydrotestosterone, 8
SMILES: C[C@]12CC[C@H]3[C@@H](CCC4=CC(=O)C=C[C@]34C)[C@@H]1CC[C@@H]2O
InChI Key: InChIKey=RSIHSRDYCUFFLA-DYKIIFRCSA-N
Data: 1 IC50
Activity Spreadsheet -- Enzyme Inhibition Constant Data from BindingDB
Found 1 hit for monomerid = 91719
Trg + Lig
Ki
nM
ΔG°
kcal/mole
IC50
nM
Kd
nM
EC50/IC50
nM
koff
s-1
kon
M-1s-1
pHTemp
°C
Cholinesterases
(Homo sapiens (Human))
BDBM91719
(1-Dehydrotestosterone, 8)
Show SMILES C[C@]12CC[C@H]3[C@@H](CCC4=CC(=O)C=C[C@]34C)[C@@H]1CC[C@@H]2O |c:12,t:8|
Show InChI InChI=1S/C19H26O2/c1-18-9-7-13(20)11-12(18)3-4-14-15-5-6-17(21)19(15,2)10-8-16(14)18/h7,9,11,14-17,21H,3-6,8,10H2,1-2H3/t14-,15-,16-,17-,18-,19-/m0/s1
Reactome pathway
n/an/a 2.09E+4n/an/an/an/an/an/a
University of Jordan
Assay Description
AChE and BChE inhibiting activities were measured in vitro by a modified spectrophotometric method previously developed by Ellman et. al.
J Enzyme Inhib Med Chem 24: 553-8 (2009)
Article DOI: 10.1080/14756360802236393
BindingDB Entry DOI: 10.7270/Q20K274X