BDBM91722 11alpha-17beta-Dihydroxyandrost-1,4-dien-3-one, 11
SMILES: C[C@]12C[C@@H](O)[C@H]3[C@@H](CCC4=CC(=O)C=C[C@]34C)[C@@H]1CC[C@@H]2O
InChI Key: InChIKey=XBDIPICFPCBNBB-RUOITVIXSA-N
Data: 1 IC50
Activity Spreadsheet -- Enzyme Inhibition Constant Data from BindingDB
Found 1 hit for monomerid = 91722
Trg + Lig
Ki
nM
ΔG°
kcal/mole
IC50
nM
Kd
nM
EC50/IC50
nM
koff
s-1
kon
M-1s-1
pHTemp
°C
Cholinesterases
(Homo sapiens (Human))
BDBM91722
(11alpha-17beta-Dihydroxyandrost-1,4-dien-3-one, 11)
Show SMILES C[C@]12C[C@@H](O)[C@H]3[C@@H](CCC4=CC(=O)C=C[C@]34C)[C@@H]1CC[C@@H]2O |c:13,t:9|
Show InChI InChI=1S/C19H26O3/c1-18-8-7-12(20)9-11(18)3-4-13-14-5-6-16(22)19(14,2)10-15(21)17(13)18/h7-9,13-17,21-22H,3-6,10H2,1-2H3/t13-,14-,15+,16-,17+,18-,19-/m0/s1
Reactome pathway
n/an/a 6.15E+4n/an/an/an/an/an/a
University of Jordan
Assay Description
AChE and BChE inhibiting activities were measured in vitro by a modified spectrophotometric method previously developed by Ellman et. al.
J Enzyme Inhib Med Chem 24: 553-8 (2009)
Article DOI: 10.1080/14756360802236393
BindingDB Entry DOI: 10.7270/Q20K274X