BDBM9181 (3R,3aS,6aR)-hexahydrofuro[2,3-b]furan-3-yl N-[(2S,3R)-4-[2H-1,3-benzodioxole-5-(cyclohexyloxy)sulfonamido]-3-hydroxy-1-phenylbutan-2-yl]carbamate::N-alkoxysulfonamide analog 22::N-alkoxysulfonamide analog entry u
SMILES: [H][C@@]12CCO[C@]1([H])OC[C@@H]2OC(=O)N[C@@H](Cc1ccccc1)[C@H](O)CN(OC1CCCCC1)S(=O)(=O)c1ccc2OCOc2c1
InChI Key: InChIKey=JZCAHOBXDOCSRW-KTJDEMTHSA-N
Data: 1 KI  1 IC50
Activity Spreadsheet -- Enzyme Inhibition Constant Data from BindingDB
Found 1 hit for monomerid = 9181
Trg + Lig
Ki
nM
ΔG°
kcal/mole
IC50
nM
Kd
nM
EC50/IC50
nM
koff
s-1
kon
M-1s-1
pHTemp
°C
HIV-1 Protease
(Human immunodeficiency virus type 1)
BDBM9181
((3R,3aS,6aR)-hexahydrofuro[2,3-b]furan-3-yl N-[(2S...)
Show SMILES [H][C@@]12CCO[C@]1([H])OC[C@@H]2OC(=O)N[C@@H](Cc1ccccc1)[C@H](O)CN(OC1CCCCC1)S(=O)(=O)c1ccc2OCOc2c1 |r|
Show InChI InChI=1S/C30H38N2O10S/c33-25(24(15-20-7-3-1-4-8-20)31-30(34)41-28-18-38-29-23(28)13-14-37-29)17-32(42-21-9-5-2-6-10-21)43(35,36)22-11-12-26-27(16-22)40-19-39-26/h1,3-4,7-8,11-12,16,21,23-25,28-29,33H,2,5-6,9-10,13-15,17-19H2,(H,31,34)/t23-,24-,25+,28-,29+/m0/s1
<0.00500n/a 13n/an/an/an/an/an/a
GlaxoSmithKline
Assay Description
The Ki values were determined using fluorogenic substrate, 2-(aminobenzoyl)-Thr-Ile-Nle-Phe(p-NO2)-Gln-ArgNH2. A standard curve relating changes in f...
Bioorg Med Chem Lett 15: 3560-4 (2005)
Article DOI: 10.1016/j.bmcl.2005.05.101
BindingDB Entry DOI: 10.7270/Q2F769SC