BDBM9195 (2R,4S)-5-[(3S,5R)-3,5-dibenzyl-2-oxopyrrolidin-1-yl]-4-hydroxy-N-[(1S,2R)-2-hydroxy-2,3-dihydro-1H-inden-1-yl]-2-({4-[2-(2-methoxyethoxy)ethoxy]phenyl}methyl)pentanamide::pyrrolidinone based inhibitor 1m
SMILES: COCCOCCOc1ccc(C[C@H](C[C@H](O)CN2[C@@H](Cc3ccccc3)C[C@H](Cc3ccccc3)C2=O)C(=O)N[C@@H]2[C@H](O)Cc3ccccc23)cc1
InChI Key: InChIKey=DPHCMTIMWUQMML-CLFXRHAGSA-N
Data: 1 KI  1 IC50
Activity Spreadsheet -- Enzyme Inhibition Constant Data from BindingDB
Found 1 hit for monomerid = 9195
Trg + Lig
Ki
nM
ΔG°
kcal/mole
IC50
nM
Kd
nM
EC50/IC50
nM
koff
s-1
kon
M-1s-1
pHTemp
°C
HIV-1 Protease
(Human immunodeficiency virus type 1)
BDBM9195
((2R,4S)-5-[(3S,5R)-3,5-dibenzyl-2-oxopyrrolidin-1-...)
Show SMILES COCCOCCOc1ccc(C[C@H](C[C@H](O)CN2[C@@H](Cc3ccccc3)C[C@H](Cc3ccccc3)C2=O)C(=O)N[C@@H]2[C@H](O)Cc3ccccc23)cc1 |r|
Show InChI InChI=1S/C44H52N2O7/c1-51-20-21-52-22-23-53-39-18-16-33(17-19-39)24-35(43(49)45-42-40-15-9-8-14-34(40)29-41(42)48)28-38(47)30-46-37(26-32-12-6-3-7-13-32)27-36(44(46)50)25-31-10-4-2-5-11-31/h2-19,35-38,41-42,47-48H,20-30H2,1H3,(H,45,49)/t35-,36+,37+,38+,41-,42+/m1/s1
0.0200 -14.6 93n/an/an/an/a6.425
GlaxoSmithKline
Assay Description
The Ki values were determined using fluorogenic substrate, 2-(aminobenzoyl)-Thr-Ile-Nle-Phe(p-NO2)-Gln-ArgNH2. A standard curve relating changes in f...
Bioorg Med Chem Lett 15: 81-4 (2005)
Article DOI: 10.1016/j.bmcl.2004.10.029
BindingDB Entry DOI: 10.7270/Q29G5K1M