BDBM92723 Phenylboronic acid, 16
SMILES: COC(=O)c1cc(cc(c1)N(=O)=O)B(O)O
InChI Key: InChIKey=CDGIRLKQNJXHBJ-UHFFFAOYSA-N
Data: 2 IC50
Activity Spreadsheet -- Enzyme Inhibition Constant Data from BindingDB
Found 2 hits for monomerid = 92723
Trg + Lig
Ki
nM
ΔG°
kcal/mole
IC50
nM
Kd
nM
EC50/IC50
nM
koff
s-1
kon
M-1s-1
pHTemp
°C
Acyl-protein thioesterase 2
(Homo sapiens (Human))
BDBM92723
(Phenylboronic acid, 16)
Show SMILES COC(=O)c1cc(cc(c1)N(=O)=O)B(O)O
Show InChI InChI=1S/C8H8BNO6/c1-16-8(11)5-2-6(9(12)13)4-7(3-5)10(14)15/h2-4,12-13H,1H3
n/an/a 2.95E+3n/an/an/an/an/an/a
Technical University of Dortmund
Assay Description
The enzyme activities were determined by measuring the release of fluorescent 6,8-difluoro-4-methylumbelliferone (DiFMU) by the APT hydrolysis of DiF...
Chembiochem 14: 115-22 (2013)
Article DOI: 10.1002/cbic.201200571
BindingDB Entry DOI: 10.7270/Q2NS0SG7
Acyl-protein thioesterase 1
(Homo sapiens (Human))
BDBM92723
(Phenylboronic acid, 16)
Show SMILES COC(=O)c1cc(cc(c1)N(=O)=O)B(O)O
Show InChI InChI=1S/C8H8BNO6/c1-16-8(11)5-2-6(9(12)13)4-7(3-5)10(14)15/h2-4,12-13H,1H3
Reactome pathway
n/an/a 3.70E+3n/an/an/an/an/an/a
Technical University of Dortmund
Assay Description
The enzyme activities were determined by measuring the release of fluorescent 6,8-difluoro-4-methylumbelliferone (DiFMU) by the APT hydrolysis of DiF...
Chembiochem 14: 115-22 (2013)
Article DOI: 10.1002/cbic.201200571
BindingDB Entry DOI: 10.7270/Q2NS0SG7