BDBM92724 Phenylboronic acid, 17
SMILES: CC(=O)c1cccc(c1)B(O)O
InChI Key: InChIKey=SJGGDZCTGBKBCK-UHFFFAOYSA-N
Data: 2 IC50
Activity Spreadsheet -- Enzyme Inhibition Constant Data from BindingDB
Found 2 hits for monomerid = 92724
Trg + Lig
Ki
nM
ΔG°
kcal/mole
IC50
nM
Kd
nM
EC50/IC50
nM
koff
s-1
kon
M-1s-1
pHTemp
°C
Acyl-protein thioesterase 2
(Homo sapiens (Human))
BDBM92724
(Phenylboronic acid, 17)
Show SMILES CC(=O)c1cccc(c1)B(O)O
Show InChI InChI=1S/C8H9BO3/c1-6(10)7-3-2-4-8(5-7)9(11)12/h2-5,11-12H,1H3
n/an/a 2.87E+3n/an/an/an/an/an/a
Technical University of Dortmund
Assay Description
The enzyme activities were determined by measuring the release of fluorescent 6,8-difluoro-4-methylumbelliferone (DiFMU) by the APT hydrolysis of DiF...
Chembiochem 14: 115-22 (2013)
Article DOI: 10.1002/cbic.201200571
BindingDB Entry DOI: 10.7270/Q2NS0SG7
Acyl-protein thioesterase 1
(Homo sapiens (Human))
BDBM92724
(Phenylboronic acid, 17)
Show SMILES CC(=O)c1cccc(c1)B(O)O
Show InChI InChI=1S/C8H9BO3/c1-6(10)7-3-2-4-8(5-7)9(11)12/h2-5,11-12H,1H3
Reactome pathway
n/an/a 3.90E+3n/an/an/an/an/an/a
Technical University of Dortmund
Assay Description
The enzyme activities were determined by measuring the release of fluorescent 6,8-difluoro-4-methylumbelliferone (DiFMU) by the APT hydrolysis of DiF...
Chembiochem 14: 115-22 (2013)
Article DOI: 10.1002/cbic.201200571
BindingDB Entry DOI: 10.7270/Q2NS0SG7