BDBM92771 Indolequinone, compd 5
SMILES: CN(C)CCC=Nc1cc(O)c2n(C)c(C)c(COc3c(F)cc(F)cc3F)c2c1O
InChI Key: InChIKey=XUBMDINRTLILKF-UHFFFAOYSA-N
Data: 1 IC50
Activity Spreadsheet -- Enzyme Inhibition Constant Data from BindingDB
Found 1 hit for monomerid = 92771
Trg + Lig
Ki
nM
ΔG°
kcal/mole
IC50
nM
Kd
nM
EC50/IC50
nM
koff
s-1
kon
M-1s-1
pHTemp
°C
Ribosyldihydronicotinamide dehydrogenase [quinone]
(Homo sapiens (Human))
BDBM92771
(Indolequinone, compd 5)
Show SMILES CN(C)CCC=Nc1cc(O)c2n(C)c(C)c(COc3c(F)cc(F)cc3F)c2c1O |w:6.6|
Show InChI InChI=1S/C22H24F3N3O3/c1-12-14(11-31-22-15(24)8-13(23)9-16(22)25)19-20(28(12)4)18(29)10-17(21(19)30)26-6-5-7-27(2)3/h6,8-10,29-30H,5,7,11H2,1-4H3
n/an/a>1.00E+4n/an/an/an/an/an/a
University of Colorado Denver
Assay Description
Cell assay using human leukemia cell line K562.
Biochemistry 50: 6678-88 (2011)
Article DOI: 10.1021/bi2002967
BindingDB Entry DOI: 10.7270/Q2H130MT