BDBM92774 Indolequinone, compd 8
SMILES: CN(C)CCC=Nc1cc(O)c2n(C)c(C)c(COc3ccccc3)c2c1O
InChI Key: InChIKey=DZBBOQWVOYAKBE-UHFFFAOYSA-N
Data: 1 IC50
Activity Spreadsheet -- Enzyme Inhibition Constant Data from BindingDB
Found 1 hit for monomerid = 92774
Trg + Lig
Ki
nM
ΔG°
kcal/mole
IC50
nM
Kd
nM
EC50/IC50
nM
koff
s-1
kon
M-1s-1
pHTemp
°C
Ribosyldihydronicotinamide dehydrogenase [quinone]
(Homo sapiens (Human))
BDBM92774
(Indolequinone, compd 8)
Show SMILES CN(C)CCC=Nc1cc(O)c2n(C)c(C)c(COc3ccccc3)c2c1O |w:6.6|
Show InChI InChI=1S/C22H27N3O3/c1-15-17(14-28-16-9-6-5-7-10-16)20-21(25(15)4)19(26)13-18(22(20)27)23-11-8-12-24(2)3/h5-7,9-11,13,26-27H,8,12,14H2,1-4H3
n/an/a>1.00E+4n/an/an/an/an/an/a
University of Colorado Denver
Assay Description
Cell assay using human leukemia cell line K562.
Biochemistry 50: 6678-88 (2011)
Article DOI: 10.1021/bi2002967
BindingDB Entry DOI: 10.7270/Q2H130MT