BDBM87054 Bisanilinopyrimidine inhibitor, 8::Bisanilinopyrimidine, 6i::US9249124, 32
SMILES: OC(=O)c1ccc(Nc2nccc(Nc3ccccc3Br)n2)cc1
InChI Key: InChIKey=NCXZWZMYZVWHNN-UHFFFAOYSA-N
Data: 5 IC50  2 Kd  1 ITC
PDB links: 1 PDB ID matches this monomer.
Activity Spreadsheet -- Enzyme Inhibition Constant Data from BindingDB
Found 5 hits for monomerid = 87054
Trg + Lig
Ki
nM
ΔG°
kcal/mole
IC50
nM
Kd
nM
EC50/IC50
nM
koff
s-1
kon
M-1s-1
pHTemp
°C
Aurora kinase A
(Homo sapiens (Human))
BDBM87054
(Bisanilinopyrimidine inhibitor, 8 | Bisanilinopyri...)
Show SMILES OC(=O)c1ccc(Nc2nccc(Nc3ccccc3Br)n2)cc1
Show InChI InChI=1S/C17H13BrN4O2/c18-13-3-1-2-4-14(13)21-15-9-10-19-17(22-15)20-12-7-5-11(6-8-12)16(23)24/h1-10H,(H,23,24)(H2,19,20,21,22)
NCI pathway
Reactome pathway
n/an/a 2.10 13n/an/an/a7.425
Moffitt Cancer Center and Research Institute
Assay Description
The formation of ADP from ATP was quantified using a coupled enzyme assay (DiscoverX) in with a fluorescent resorufin dye is generated from the inter...
ACS Chem Biol 7: 698-706 (2012)
Article DOI: 10.1021/cb200508b
BindingDB Entry DOI: 10.7270/Q2PK0DRH
3D
3D Structure (crystal)
Aurora kinase A
(Homo sapiens (Human))
BDBM87054
(Bisanilinopyrimidine inhibitor, 8 | Bisanilinopyri...)
Show SMILES OC(=O)c1ccc(Nc2nccc(Nc3ccccc3Br)n2)cc1
Show InChI InChI=1S/C17H13BrN4O2/c18-13-3-1-2-4-14(13)21-15-9-10-19-17(22-15)20-12-7-5-11(6-8-12)16(23)24/h1-10H,(H,23,24)(H2,19,20,21,22)
NCI pathway
Reactome pathway
n/an/a 2.10n/an/an/an/an/an/a
Moffitt Cancer Center
Assay Description
In vitro enzyme activity assay using Aurora Kinase A.
J Med Chem 55: 7392-416 (2012)
Article DOI: 10.1021/jm300334d
BindingDB Entry DOI: 10.7270/Q2V986NH
3D
3D Structure (crystal)
Aurora kinase A
(Homo sapiens (Human))
BDBM87054
(Bisanilinopyrimidine inhibitor, 8 | Bisanilinopyri...)
Show SMILES OC(=O)c1ccc(Nc2nccc(Nc3ccccc3Br)n2)cc1
Show InChI InChI=1S/C17H13BrN4O2/c18-13-3-1-2-4-14(13)21-15-9-10-19-17(22-15)20-12-7-5-11(6-8-12)16(23)24/h1-10H,(H,23,24)(H2,19,20,21,22)
NCI pathway
Reactome pathway
US Patent
n/an/a 2.10 13n/an/an/a7.4n/a
H. Lee Moffitt Cancer Center and Research Institute, Inc.
US Patent
Assay Description
The binding of inhibitors to Aurora A kinase was analyzed with a MicroCal iTC200 titration calorimeter (GE Healthcare, Piscataway, N.J.). The protein...
US Patent US9249124 (2016)
BindingDB Entry DOI: 10.7270/Q2J1020R
3D
3D Structure (crystal)
Aurora kinase A
(Homo sapiens (Human))
BDBM87054
(Bisanilinopyrimidine inhibitor, 8 | Bisanilinopyri...)
Show SMILES OC(=O)c1ccc(Nc2nccc(Nc3ccccc3Br)n2)cc1
Show InChI InChI=1S/C17H13BrN4O2/c18-13-3-1-2-4-14(13)21-15-9-10-19-17(22-15)20-12-7-5-11(6-8-12)16(23)24/h1-10H,(H,23,24)(H2,19,20,21,22)
NCI pathway
Reactome pathway
US Patent
n/an/a 2.10n/an/an/an/a7.418
H. Lee Moffitt Cancer Center and Research Institute, Inc.
US Patent
Assay Description
Aurora A was exchanged into 50 mM phosphate buffer (pH 7.4) including 1 mM DTT via PD-10 columns and was concentrated to 20 mg mL-1 using Amicon Ultr...
US Patent US9249124 (2016)
BindingDB Entry DOI: 10.7270/Q2J1020R
3D
3D Structure (crystal)
Aurora kinase A
(Homo sapiens (Human))
BDBM87054
(Bisanilinopyrimidine inhibitor, 8 | Bisanilinopyri...)
Show SMILES OC(=O)c1ccc(Nc2nccc(Nc3ccccc3Br)n2)cc1
Show InChI InChI=1S/C17H13BrN4O2/c18-13-3-1-2-4-14(13)21-15-9-10-19-17(22-15)20-12-7-5-11(6-8-12)16(23)24/h1-10H,(H,23,24)(H2,19,20,21,22)
NCI pathway
Reactome pathway
US Patent
n/an/a 2.10n/an/an/an/a7.425
H. Lee Moffitt Cancer Center and Research Institute, Inc.
US Patent
Assay Description
Reactions were carried out at room temperature in 15 mM HEPES buffer (pH 7.4) containing 20 mM NaCl, 1 mM EGTA, 0.02% Tween 20, 10 mM MgCl2, 5% (v/v)...
US Patent US9249124 (2016)
BindingDB Entry DOI: 10.7270/Q2J1020R
3D
3D Structure (crystal)
Activity Spreadsheet -- ITC Data from BindingDB
Found 1 hit for monomerid = 87054
Cell (A)Syringe (B)Cell
Syringe
Cell + Syr
ΔG°
kcal/mole
-TΔS°
kcal/mole
ΔH°
kcal/mole
log KpHTemp
°C
Serine/threonine-protein kinase Aurora-A
(Homo sapiens (Human))
BDBM87054
JPEG
(Bisanilinopyrimidine inhibitor, 8 | Bisanilinopyri...)
n/a-4.06-15.0n/a7.4025
Moffitt Cancer Center and Research Institute
ACS Chem Biol 7: 698-706 (2012)