BDBM92971 Amphiphile, VI
SMILES: CC(C)CCCC(C)C1CCC2C3CC=C4CC(CCC4(C)C3CCC12C)C(=O)OC(C[NH+](C)C)C[N+](C)(C)C
InChI Key: InChIKey=PEUFDGUSLWHDHU-UHFFFAOYSA-O
Data: 1 IC50
Activity Spreadsheet -- Enzyme Inhibition Constant Data from BindingDB
Found 1 hit for monomerid = 92971
Trg + Lig
Ki
nM
ΔG°
kcal/mole
IC50
nM
Kd
nM
EC50/IC50
nM
koff
s-1
kon
M-1s-1
pHTemp
°C
Protein kinase C alpha
(Rattus norvegicus (Rat))
BDBM92971
(Amphiphile, VI)
Show SMILES CC(C)CCCC(C)C1CCC2C3CC=C4CC(CCC4(C)C3CCC12C)C(=O)OC(C[NH+](C)C)C[N+](C)(C)C |t:14|
Show InChI InChI=1S/C36H65N2O2/c1-25(2)12-11-13-26(3)31-16-17-32-30-15-14-28-22-27(18-20-35(28,4)33(30)19-21-36(31,32)5)34(39)40-29(23-37(6)7)24-38(8,9)10/h14,25-27,29-33H,11-13,15-24H2,1-10H3/q+1/p+1
Reactome pathway
n/an/a 1.10E+4n/an/an/an/a7.530
McMaster University
Assay Description
The triton X-100 assay previously described by Bell and co-workers were used to measure enzyme activity.
Biochemistry 31: 9025-30 (1992)
Article DOI: 10.1021/bi00152a045
BindingDB Entry DOI: 10.7270/Q2W66JCK