BDBM9303 (3S,4aS,8aS)-N-tert-butyl-2-[(2R,3S)-2-hydroxy-3-[(2S)-2-[(3R)-oxolan-3-yl]-2-(quinoxalin-2-ylformamido)acetamido]-4-phenylbutyl]-decahydroisoquinoline-3-carboxamide::Ro 31-8959 (Saquinavir) analog 37
SMILES: CC(C)(C)NC(=O)[C@@H]1C[C@@H]2CCCC[C@@H]2CN1C[C@@H](O)[C@H](Cc1ccccc1)NC(=O)[C@@H](NC(=O)c1cnc2ccccc2n1)[C@H]1CCOC1
InChI Key: InChIKey=MGUCDSPLDUZWFB-XXPPFYJHSA-N
Data: 1 IC50
Activity Spreadsheet -- Enzyme Inhibition Constant Data from BindingDB
Found 1 hit for monomerid = 9303
Trg + Lig
Ki
nM
ΔG°
kcal/mole
IC50
nM
Kd
nM
EC50/IC50
nM
koff
s-1
kon
M-1s-1
pHTemp
°C
HIV-1 Protease
(Human immunodeficiency virus type 1)
BDBM9303
((3S,4aS,8aS)-N-tert-butyl-2-[(2R,3S)-2-hydroxy-3-[...)
Show SMILES CC(C)(C)NC(=O)[C@@H]1C[C@@H]2CCCC[C@@H]2CN1C[C@@H](O)[C@H](Cc1ccccc1)NC(=O)[C@@H](NC(=O)c1cnc2ccccc2n1)[C@H]1CCOC1 |r|
Show InChI InChI=1S/C39H52N6O5/c1-39(2,3)44-37(48)33-20-26-13-7-8-14-27(26)22-45(33)23-34(46)31(19-25-11-5-4-6-12-25)42-38(49)35(28-17-18-50-24-28)43-36(47)32-21-40-29-15-9-10-16-30(29)41-32/h4-6,9-12,15-16,21,26-28,31,33-35,46H,7-8,13-14,17-20,22-24H2,1-3H3,(H,42,49)(H,43,47)(H,44,48)/t26-,27+,28-,31-,33-,34+,35-/m0/s1
n/an/a 0.120n/an/an/an/a5.530
Merck Research Laboratories
Assay Description
Sensitivity of HIV-1 protease activity to protease inhibitors was determined by a peptide substrate cleavage assay. The products were analyzed by usi...
J Med Chem 36: 2300-10 (1993)
Article DOI: 10.1021/jm00068a006
BindingDB Entry DOI: 10.7270/Q28G8HX8